{"text_format":"1","workbook":"xlsx","n_sheets":10,"sheets":["Instructions","Provider Info","Access & Input","Leases","Services & Housing","Project Specific","Report Summary","Scratch - List","Scratch - Report","Assumptions"],"not_rendered":{"charts":8,"images":1,"macros":1,"external_links":0,"defined_names":6,"comments":0,"pivot_tables":0},"unopened":[],"bounds":{"document_bytes":16777216,"sheet_cells":100000,"rows_first":2000,"rows_last":500,"rows_between":2000,"halvings":0,"cell_chars":16384,"cell_head_chars":4096},"cells_cut":0,"cells_raw":0,"read":"whole","date_system":"1900"}

{"sheet":"Instructions","index":0,"n_rows":57,"n_cols":5,"rows_kept":57,"cut":false,"hidden":false,"merged":[]}
[]
[]
[]
[]
[]
[]
[]
[]
[]
[]
[null,null,"Housing First Standards Assessment Tool"]
[]
[]
[]
[]
[]
[]
[]
[]
[]
[]
[]
[]
[]
[]
[null,null,"Project Type","Applicable Standards"]
[null,null,"Coordinated Entry","Access & Evaluation; Project-specific"]
[null,null,"Street Outreach","Access & Evaluation; Project-specific"]
[null,null,"Emergency Shelter","Access & Evaluation; Service & Housing; Project-specific"]
[null,null,"Transitional Housing","Access & Evaluation; Service & Housing; Leases; Project-specific"]
[null,null,"Rapid Rehousing","Access & Evaluation; Service & Housing; Leases; Project-specific"]
[null,null,"Permanent Supportive Housing","Access & Evaluation; Service & Housing; Leases; Project-specific"]
[]
[]
[]
[]
[]
[]
[]
[]
[]
[]
[]
[]
[]
[]
[]
[]
[]
[null,null,"Tab","Description","Purpose"]
[null,null,"Instructions","Tool overview and aim","Offers instruction to users on the assessment tool"]
[null,null,"Provider Info","Input provider, project and general assessment information","Determines project-specific standards for consideration"]
[null,null,"Standards - Access & Evaluation","Input compliance with standards concerning participant access to the project and input, project evaluation and performance management","Assesses whether access and evaluation are compliant with Housing First principles"]
[null,null,"Standards - Leases","Input compliance with standards concerning the lease and occupancy agreements, where applicable","Assesses whether leases and occupancy agreements are compliant with Housing First principles"]
[null,null,"Standards - Services & Housing","Input compliance with standards concerning the service and housing models and structure, where applicable","Assesses whether services and housing are compliant with Housing First principles"]
[null,null,"Standards – Project-Specific","Prompts assessment standards based on project type and targeted sub-populations served by the project, where applicable","Assesses whether specific project standards are compliant with Housing First principles"]
[null,null,"Report Summary","Displays assessment scores and conclusions, and highlights non-compliant standards","Printable summary of the assessment"]

{"sheet":"Provider Info","index":1,"n_rows":44,"n_cols":3,"rows_kept":44,"cut":false,"hidden":false,"merged":[[23,1,23,2]]}
["Provider Information"]
[]
[null,"Please complete the information below on the organization being assessed."]
[]
[null,"Provider Information"]
[null,"Provider's Legal Name","[Test Provider]"]
[null,"Acronym (If Applicable)"]
[null,"Year Incorporated"]
[null,"EIN"]
[null,"Street Address"]
[null,"Zip Code"]
[]
[]
[null,"Project Information"]
[null,"Project Name"]
[null,"Project Budget"]
[null,"Grant Number"]
[]
[null,"Name of Project Director"]
[null,"Project Director Email Address"]
[null,"Project Director Phone Number"]
[]
[null,"Which best describes the project *","Joint Transitional Housing & Rapid Rehousing"]
[null,"If project is a Safe Haven, please choose project type that it most operates like, e.g. shelter, transitional housing, or permanent housing"]
[]
[null,"Are your services targeted to any of the following populations specifically? Please select one if so, as this impacts your assessment questions.","People in Recovery"]
[null,"*Please note that when you select a project type, particular standards may not be relevant."]
[]
[null,"Management Information"]
[null,"Name of CEO"]
[null,"CEO Email Address"]
[null,"CEO Phone Number"]
[]
[null,"Name of Staff Member Guiding Assessment"]
[null,"Staff Email Address"]
[null,"Staff Phone Number"]
[]
[]
[null,"Assessment Information"]
[null,"Name of Assessor"]
[null,"Organizational Affiliation of Assessor"]
[null,"Assessor Email Address"]
[null,"Assessor Phone Number"]
[null,"Date of Assessment","2016-11-02"]

{"sheet":"Access & Input","index":2,"n_rows":25,"n_cols":8,"rows_kept":25,"cut":false,"hidden":false,"merged":[]}
[null,"Housing First Standards"]
[]
[null,null,"For each standard, please use the drop down boxes in the three columns to the right to select “Not at all” or “Sometimes” or \"Always\". Marking \"Always\" "]
[null,null,"signifies full compliance for the standard."]
[]
[null,"No.","Standard","Access Definition / Evidence",null,"Say It","Document it","Do it"]
[null,1,"Projects are low-barrier","Admission to projects is not contingent on pre-requisites such as abstinence of substances, minimum income requirements, health or mental health history, medication adherence, age, criminal justice history, financial history, completion of treatment, participation in services, “housing readiness,” history or occurrence of victimization, survivor of sexual assault or an affiliated person of such a survivor or other unnecessary conditions unless required by law or funding source.",null,"Please select answer","Please select answer","Please select answer"]
[null,null,null,"Optional notes here"]
[null,{"$f":"B7+1","v":2},"Projects do not deny assistance for unnecessary reasons","Procedures and oversight demonstrate that staff do everything possible to avoid denying assistance or rejecting an individual or family for the reasons listed in Access Standard #1.  ",null,"Please select answer","Please select answer","Please select answer"]
[null,null,null,"Optional notes here"]
[null,{"$f":"B9+1","v":3},"Access regardless of sexual orientation, gender identity, or marital status","Equal access is provided in accordance with the 2012 and 2016 Equal Access Rules, meaning that any project funded by HUD must ensure equal access for persons regardless of one’s sexual orientation or marital status, and in accordance with one’s gender identity. Adult only households, regardless of marital status, should have equal access to projects (if these project types are not available within a CoC, the CoC should conduct an assessment to determine if these project types are needed and work with providers to accommodate the need). Please see Equal Access Rules here: https://www.hudexchange.info/resource/1991/equal-access-to-housing-final-rule/ ",null,"Please select answer","Please select answer","Please select answer"]
[null,null,null,"Optional notes here"]
[null,{"$f":"B11+1","v":4},"Admission process is expedited with speed and efficiency","Projects have expedited admission processes, to the greatest extent possible, including helping participants obtain documentation required by funding sources, as well as processes to admit participants regardless of the status of their eligibility documentation whenever applicable.",null,"Please select answer","Please select answer","Please select answer"]
[null,null,null,"Optional notes here"]
[null,{"$f":"B13+1","v":5}," Intake processes are person-centered and flexible","Intake and assessment procedures are focused on the individual’s or family’s strengths, needs, and preferences. Projects do not require specific appointment times, but have flexible intake schedules that ensure access to all households. Assessments are focused on identifying household strengths, resources, as well as identifying barriers to housing that can inform the basis of a housing plan as soon as a person is enrolled in the project. ",null,"Please select answer","Please select answer","Please select answer"]
[null,null,null,"Optional notes here"]
[null,{"$f":"B15+1","v":6},"The provider/project accepts and makes referrals directly through Coordinated Entry","Projects actively participate in the CoC-designated Coordinated Entry processes as part of streamlined community-wide system access and triage. If these processes are not yet implemented, projects follow communities’ existing referral processes. Referrals from Coordinated Entry are rarely rejected, and only if there is a history of violence, the participant does not want to be in the project, there are legally valid grounds (such as restrictions regarding sex offenders)  or some other exceptional circumstance that is well documented.",null,"Please select answer","Please select answer","Please select answer"]
[null,null,null,"Optional notes here"]
[null,{"$f":"B17+1","v":7},"Exits to homelessness are avoided","Projects that can no longer serve particular households utilize the coordinated entry process, or the communities’ existing referral processes if coordinated entry processes are not yet implemented, to ensure that those individuals and families have access to other housing and services as desired, and do not become disconnected from services and housing. Households encounter these exits under certain circumstances, such as if they demonstrate violent or harassing behaviors, which are described within agencies’ regulation-adherent policies.",null,"Please select answer","Please select answer","Please select answer"]
[null,null,null,"Optional notes here"]
[null,null,"Name","Participant Input Definition / Evidence",null,"Say It","Document it","Do it"]
[null,1,"Participant education is ongoing","Project participants receive ongoing education on Housing First principles as well as other service models employed in the project. In the beginning of and throughout tenancy, participants are informed about their full rights and responsibilities as lease holders, including the potential causes for eviction. ",null,"Please select answer","Please select answer","Please select answer"]
[null,null,null,"Optional notes here"]
[null,{"$f":"B22+1","v":2},"Projects create regular, formal opportunities for participants to offer input","Input is welcomed regarding the project’s policies, processes, procedures, and practices. Opportunities include involvement in: quality assurance and evaluation processes, a participant leadership/advisory board, processes to formally communicate with landlords, the design of and participation in surveys and focus groups, planning social gatherings, integrating peer specialists and peer-facilitated support groups to compliment professional services.",null,"Please select answer","Please select answer","Please select answer"]
[null,null,null,"Optional notes here"]

{"sheet":"Leases","index":3,"n_rows":20,"n_cols":11,"rows_kept":20,"cut":false,"hidden":false,"merged":[]}
[null,"Housing First Standards"]
[]
[null,null,"For each standard, please use the drop down boxes in the three columns to the right to select “Not at all” or “Sometimes” or \"Always\". Marking \"Always\" "]
[null,null,"signifies full compliance for the standard."]
[]
[null,null,{"$f":"IF(OR('Provider Info'!$C$23=\"Coordinated Entry\",'Provider Info'!$C$23=\"Street Outreach\",'Provider Info'!$C$23=\"Emergency Shelter\"),\"\",\"Standard\")","v":"Standard"},{"$f":"IF(OR('Provider Info'!$C$23=\"Coordinated Entry\",'Provider Info'!$C$23=\"Street Outreach\",'Provider Info'!$C$23=\"Emergency Shelter\"),\"This section is not applicable. Please see following section.\",\"Lease and Occupancy Definition / Evidence\")","v":"Lease and Occupancy Definition / Evidence"},null,{"$f":"IF(OR('Provider Info'!$C$23=\"Coordinated Entry\",'Provider Info'!$C$23=\"Street Outreach\",'Provider Info'!$C$23=\"Emergency Shelter\"),\"\",\"Say It\")","v":"Say It"},{"$f":"IF(OR('Provider Info'!$C$23=\"Coordinated Entry\",'Provider Info'!$C$23=\"Street Outreach\",'Provider Info'!$C$23=\"Emergency Shelter\"),\"\",\"Document It\")","v":"Document It"},{"$f":"IF(OR('Provider Info'!$C$23=\"Coordinated Entry\",'Provider Info'!$C$23=\"Street Outreach\",'Provider Info'!$C$23=\"Emergency Shelter\"),\"\",\"Do It\")","v":"Do It"},null,"Name"]
[null,1,"Housing is considered permanent (not applicable for Transitional Housing)","Housing is not time-limited (though rent assistance may be) and leases are automatically renewable upon expiration, except with prior notice by either party. ",null,"Please select answer","Please select answer","Please select answer",null,"Housing is considered permanent (not applicable for Transitional Housing)","Housing is not time-limited (though rent assistance for rapid rehousing may be), and leases have a term of at least one year and are automatically renewable upon expiration for terms that are a minimum of one month long, except on prior notice by either party.  Occupancy agreements for transitional housing may be less than a year."]
[null,null,null,"Optional notes here",null,null,null,null,null,null,"Optional notes here"]
[null,{"$f":"B7+1","v":2},"Participant choice is fundamental","A participant has, at minimum, choices in deciding the location and type of housing based on preferences from a range of housing types and among multiple units, as available and as practical. In project-based settings, participants should be offered choice of units within a particular building, or within the portfolio of single site properties. In projects that use shared housing, i.e. housing with unrelated roommates, participants should be offered choice of roommates, as available and as practical. Additionally, as applicable, participants are able to choose their roommates when sharing a room or unit.",null,"Please select answer","Please select answer","Please select answer",null,"Participant choice is fundamental","A participant has choice in location and type of housing they prefer from a range of housing types and among multiple units, as available and as practical. Tenant also has choice in other features of housing. A reasonable waiting period is the allowed \"search\" time for the project. Additionally, as applicable, participants are able to choose their roommates when sharing a room or unit."]
[null,null,null,"Optional notes here",null,null,null,null,null,null,"Optional notes here"]
[null,{"$f":"B9+1","v":3},"Leases are the same for participants as for other tenants","Leases do not have any provisions that would not be found in leases held by any other tenant in the property or building and is renewable per the participants’ and owner’s choice. People experiencing homelessness who receive help moving into permanent housing should have leases that confer the full rights, responsibilities, and legal protections under Federal, state, and local housing laws. For transitional housing, there may be limitations on length of stay, but a lease/occupancy agreement should look like a lease that a person would have in the normal rental market. ",null,"Please select answer","Please select answer","Please select answer",null,"Leases are the same","Leases do not have any provisions that would not be found in leases held by any other tenant in the property/building/etc. and is renewable at the participants’ and owner’s option. People experiencing homelessness who receives help moving into permanent housing should have leases that confer the full rights, responsibilities, and legal protections under Federal, state, and local housing laws. For transitional housing, there may be limitations on length of stay, but a lease/occupancy agreement should look like a lease/occupancy agreement in any other transitional housing projects. "]
[null,null,null,"Optional notes here",null,null,null,null,null,null,"Optional notes here"]
[null,{"$f":"B11+1","v":4},"Participants receive education about their lease or occupancy agreement terms","Participants are also given access to legal assistance and encouraged to exercise their full legal rights and responsibilities. Landlords and providers abide by their legally-defined roles and responsibilities.",null,"Please select answer","Please select answer","Please select answer",null,"Participants are educated about their lease or occupancy agreement terms","They are also given access to legal assistance, and encouraged to exercise their full legal rights and responsibilities. Landlords and providers in Housing First models abide by their legally defined roles and responsibilities. For instance, landlords and providers do not enter participants' apartments or rooms without participants' knowledge and permission except under legally-defined emergency circumstances.  "]
[null,null,null,"Optional notes here",null,null,null,null,null,null,"Optional notes here"]
[null,{"$f":"B13+1","v":5},"Measures are used to prevent eviction","Property or building management, with services support, incorporates a culture of eviction avoidance, reinforced through practices and policies that prevent lease violations and evictions among participants, and evict participants only when they are a threat to self or others. Clear eviction appeal processes and due process is provided for all participants. Lease bifurcation is allowed so that a tenant or lawful occupant who is a victim of a criminal act of physical violence committed against them by another tenant or lawful occupant is not evicted, removed or penalized if the other is evicted. ",null,"Please select answer","Please select answer","Please select answer",null,"Eviction Prevention is essential","Property or building management, with services support, incorporates practices and policies that prevent lease violations and evictions among participants.  A culture of “write-ups” in the project/building should be avoided. Rather, staff should find a balance between a “no-fail” approach and one with natural consequences. For transitional housing, the same applies for exits.  Ideally, exits should be for positive outcomes (moving to permanent housing). "]
[null,null,null,"Optional notes here",null,null,null,null,null,null,"Optional notes here"]
[null,{"$f":"B15+1","v":6},"Providing stable housing is a priority","Providers engage in a continued effort to hold housing for participants, even if they leave their housing for short periods due to treatment, illness, or any other temporary stay outside of the unit.  ",null,"Please select answer","Please select answer","Please select answer",null,"Housing is stable","Agencies engage in a continued effort to hold housing for participants, even if they leave their housing for short periods due to treatment, illness, or any other temporary stay outside of the unit.  "]
[null,null,null,"Optional notes here",null,null,null,null,null,null,"Optional notes here"]
[null,{"$f":"B17+1","v":7},"Rent payment policies respond to tenants’ needs (as applicable)","While tenants are accountable to the rental agreement, adjustments may be needed on a case by case basis. As necessary, participants are given special payment arrangements for rent arrears and/or assistance with financial management, including representative payee arrangements. ",null,"Please select answer","Please select answer","Please select answer",null,"Rent payment policies respond to tenant needs (as applicable)","While tenants are accountable to the rental agreement and need to pay rent (or have it paid) based on that agreement, at times, adjustments may be needed on a case by case basis.  As necessary, participants are given special payment arrangements for rent arrears and/or assistance with financial management, including representative payee arrangements.  Agencies should also demonstrate that payment plans for rent arrearages are developed and followed as needed. In some cases of transitional housing, program fees may be collected rather than rent.  The same standard applies for program fees in temporary housing.  "]
[null,null,null,"Optional notes here",null,null,null,null,null,null,"Optional notes here"]

{"sheet":"Services & Housing","index":4,"n_rows":29,"n_cols":11,"rows_kept":29,"cut":false,"hidden":false,"merged":[]}
[null,"Housing First Standards"]
[]
[null,null,"For each standard, please use the drop down boxes in the three columns to the right to select “Not at all” or “Sometimes” or \"Always\". Marking \"Always\" "]
[null,null,"signifies full compliance for the standard."]
[]
[null,null,{"$f":"IF(OR('Provider Info'!$C$23=\"Coordinated Entry\",'Provider Info'!$C$23=\"Street Outreach\"),\"\",\"Standard\")","v":"Standard"},{"$f":"IF(OR('Provider Info'!$C$23=\"Coordinated Entry\",'Provider Info'!$C$23=\"Street Outreach\"),\"This section is not applicable. Please see following section.\",\"Services Definition / Evidence\")","v":"Services Definition / Evidence"},null,{"$f":"IF(OR('Provider Info'!$C$23=\"Coordinated Entry\",'Provider Info'!$C$23=\"Street Outreach\"),\"\",\"Say it\")","v":"Say it"},{"$f":"IF(OR('Provider Info'!$C$23=\"Coordinated Entry\",'Provider Info'!$C$23=\"Street Outreach\"),\"\",\"Document it\")","v":"Document it"},{"$f":"IF(OR('Provider Info'!$C$23=\"Coordinated Entry\",'Provider Info'!$C$23=\"Street Outreach\"),\"\",\"Do it\")","v":"Do it"}]
[null,1,"Projects promote participant choice in services","Participants are able to choose from an array of services. Services offered are housing focused and include the following areas of support: employment and income, childhood and education, community connection, and stabilization to maintain housing.  These should be provided by linking to community-based services.",null,"Please select answer","Please select answer","Please select answer",null,"Participants choose the type of services they receive","Participants, with professional support, are the primary authors of their housing related service plans, as applicable (not every participant may need a plan).  Participants initiate and are offered routine opportunities to modify their plan."]
[null,null,null,"Optional notes here",null,null,null,null,null,null,"Optional notes here"]
[null,{"$f":"B7+1","v":2},{"$f":"IF(OR('Provider Info'!$C$23=\"Coordinated Entry\",'Provider Info'!$C$23=\"Street Outreach\"),\"Not applicable. Please see following section.\",J9)","v":"Person Centered Planning is a guiding principle of the service planning process"},"Person-centered Planning is a guiding principle of the service planning process",null,"Please select answer","Please select answer","Please select answer",null,"Person Centered Planning is a guiding principle of the service planning process","Participants create their own service plans with guidance from staff.  Participants have option of a peer to assist with that process.  Service plans are reviewed with participants and regularly offered as a resource to Participants."]
[null,null,null,"Optional notes here",null,null,null,null,null,null,"Optional notes here"]
[null,{"$f":"B9+1","v":3},"Service support is as permanent as the housing","Service connections are permanently available and accessible for participants in Permanent Supportive Housing.  Rapid Re-Housing projects should, at a minimum, be prepared to offer services for up to 6 months after the rental assistance ends. In emergency shelter and transitional housing, services are available as long as the participant resides in the unit or bed – and up to 6 months following exit from transitional housing.  ",null,"Please select answer","Please select answer","Please select answer",null,"Service support is as permanent as the housing","Services are permanent for Permanent Supportive Housing and last for up to two years for Rapid Rehousing.  In emergency shelter and transitional housing, services are available as long as the client resides in the unit or bed."]
[null,null,null,"Optional notes here",null,null,null,null,null,null,"Optional notes here"]
[null,{"$f":"B11+1","v":4},"Services are continued despite change in housing status or placement","Wherever possible, participants continue to be offered services even if they lose their housing unit or bed (for congregate projects), or if they are placed in a short-term inpatient treatment. Ideally, the service relationship should continue, despite a service hiatus during some institutional stays.  ",null,"Please select answer","Please select answer","Please select answer",null,"Continuation of services","As feasible, participants continue to receive services even if they lose their unit, or bed (for place based projects) or are placed in a short-term inpatient treatment. There may be a service hiatus, but the service relationship should continue."]
[null,null,null,"Optional notes here",null,null,null,null,null,null,"Optional notes here"]
[null,{"$f":"B13+1","v":5},"Participant engagement is a core component of service delivery","Staff provide effective services by developing relationships with participants that provide immediate needs and safety, develop trust and common ground, making warm hand-offs to other mainstream service providers, and clearly explain staff roles.  Engagement is regular and relationships are developed over time. ",null,"Please select answer","Please select answer","Please select answer",null,"Services are provided through engagement models","Staff develop relationships with clients to provide effective services by: a) providing for immediate needs and safety, b) developing trust and finding common ground, c) introducing participant to services relationship, d) clearly explaining staff roles"]
[null,null,null,"Optional notes here",null,null,null,null,null,null,"Optional notes here"]
[null,{"$f":"B15+1","v":6},"Services are culturally appropriate with translation services available, as needed","Project staff are sensitive to and support the cultural aspects of diverse households. Wherever possible, staff demographics reflect the participant population they serve in order to provide appropriate, culturally-specific services. Translation services are provided when needed to ensure full comprehension of the project. Projects that serve families with children should have family-friendly rules that allow for different schedules based on work and school hours and have services that allow parents to participate in activities without having to constantly supervise their children themselves (i.e. can use the bathroom or take a shower without their children being in the bathroom with them).",null,"Please select answer","Please select answer","Please select answer",null,"Services should be culturally and linguistically appropriate","In order to best serve people in a housing first setting, staff in agencies understand households based on their cultural background.  Ideally, staff reflect the participant population they serve to provide appropriate, culturally specific services as needed.  This helps Participants feel comfortable, understood, and accepted and therefore, more likely to engage. "]
[null,null,null,"Optional notes here",null,null,null,null,null,null,"Optional notes here"]
[null,{"$f":"B17+1","v":7},"Staff are trained in clinical and non-clinical strategies (including harm reduction, motivational interviewing, trauma-informed approaches, strength-based)","Services support a participant’s ability to obtain and retain housing regardless of changes in behavior.  Services are informed by a harm-reduction philosophy, such as recognizing that substance use and addiction are a part of some participants' lives. Participants are engaged in non-judgmental communication regarding their behavior and are offered education regarding how to avoid risky behaviors and engage in safer practices.",null,"Please select answer","Please select answer","Please select answer",null,"Staff are appropriately trained in clinical and non-clinical strategies (e.g. harm reduction, motivational interviewing, trauma informed approaches)","Services support a participant’s ability to obtain and retain housing while not expecting or requiring changes in behavior to secure housing.  Services are informed by a harm-reduction philosophy that recognizes that drug and alcohol use and addiction are a part of some participants' lives.  Participants are engaged in non-judgmental communication regarding drug and alcohol use and are offered education regarding how to avoid risky behaviors and engage in safer practices."]
[null,null,null,"Optional notes here",null,null,null,null,null,null,"Optional notes here"]
[null,null,{"$f":"IF(OR('Provider Info'!$C$23=\"Coordinated Entry\",'Provider Info'!$C$23=\"Street Outreach\"),\"\",\"Standard\")","v":"Standard"},{"$f":"IF(OR('Provider Info'!$C$23=\"Coordinated Entry\",'Provider Info'!$C$23=\"Street Outreach\"),\"This section is not applicable. Please see following section.\",\"Housing Definition / Evidence\")","v":"Housing Definition / Evidence"},null,{"$f":"IF(OR('Provider Info'!$C$23=\"Coordinated Entry\",'Provider Info'!$C$23=\"Street Outreach\"),\"\",\"Say It\")","v":"Say It"},{"$f":"IF(OR('Provider Info'!$C$23=\"Coordinated Entry\",'Provider Info'!$C$23=\"Street Outreach\"),\"\",\"Document It\")","v":"Document It"},{"$f":"IF(OR('Provider Info'!$C$23=\"Coordinated Entry\",'Provider Info'!$C$23=\"Street Outreach\"),\"\",\"Do It\")","v":"Do It"},null,"Name"]
[null,1,"Housing is not dependent on participation in services","Participation in permanent and temporary housing settings,  as well as crisis settings such as emergency shelter, is not contingent on participating in supportive services or demonstration of progress made on a service plan.  Services must be offered by staff, but are voluntary for participants. ",null,"Please select answer","Please select answer","Please select answer",null,"Housing (permanent and temporary, including emergency shelter) is not dependent on participation in services","Participants are not terminated from the project for reasons such as failure to participate in supportive services, failure to make progress on a service plan. Services are voluntary for participants but not for staff.  "]
[null,null,null,"Optional notes here",null,null,null,null,null,null,"Optional notes here"]
[null,{"$f":"B22+1","v":2},"Substance use is not a reason for termination","Participants are only terminated from the project for violations in the lease or occupancy agreements, as applicable.  Occupancy agreements or an addendum to the lease do not include conditions around substance use or participation in services. If the project is a recovery housing model focused on people who are in early recovery from drugs or alcohol (as outlined in HUD’s Recovery Housing Brief), different standards related to use and subsequent offer of treatment may apply. See HUD's Recovery Housing brief here: https://www.hudexchange.info/resource/4852/recovery-housing-policy-brief/",null,"Please select answer","Please select answer","Please select answer",null,"Substance use, in and of itself, is not a reason for termination","Participants are only terminated from the project for lease (for permanent housing) or occupancy agreement violations, as applicable.  Clear appeal processes and due process is provided for all participants. If the project is recovery oriented, different standards may apply."]
[null,null,null,"Optional notes here",null,null,null,null,null,null,"Optional notes here"]
[null,{"$f":"B24+1","v":3},"The rules and regulations of the project are centered on participants’ rights","Project staff have realistic expectations and policies. Rules and regulations are designed to support safe and stable communities and should never interfere with a life in the community. Participants have access to the project at all hours (except for nightly in and out shelter) and accommodation is made for pets.",null,"Please select answer","Please select answer","Please select answer",null,"Participant rights are integral to any project rules","Project staff do not have unrealistic expectations and policies. From time to time rules may be necessary to support safe and stable communities.  However, those rules (if there are any) are limited and are similar to those found in other place based projects and do not interfere with a life in the community."]
[null,null,null,"Optional notes here",null,null,null,null,null,null,"Optional notes here"]
[null,{"$f":"B26+1","v":4},"Participants have the option to transfer to another project","Transfers should be accommodated for tenants who reasonably believe that they are threatened with imminent harm from further violence if the tenant remains in the same unit. Whenever possible, transfers occur before a participant experiences homelessness.  ",null,"Please select answer","Please select answer","Please select answer",null,"Transfers are an option","Every effort is made to provide a participant the opportunity to transfer from one project to another if a stay (or tenancy) is in jeopardy.  Whenever possible, discharge into homelessness is avoided."]
[null,null,null,"Optional notes here",null,null,null,null,null,null,"Optional notes here"]

{"sheet":"Project Specific","index":5,"n_rows":31,"n_cols":8,"rows_kept":31,"cut":false,"hidden":false,"merged":[]}
[null,"Housing First Standards"]
[]
[null,null,"For each standard, please use the drop down boxes in the three columns to the right to select “Not at all” or “Sometimes” or \"Always\". Marking \"Always\" "]
[null,null,"signifies full compliance for the standard."]
[]
[null,null,"Standard","Project -Specific Standards",null,"Say It","Document it","Do it"]
[null,1,{"$f":"IF('Provider Info'!$C$23=Assumptions!C$6,Assumptions!C$7,IF('Provider Info'!$C$23=Assumptions!D$6,Assumptions!D$7,IF('Provider Info'!$C$23=Assumptions!E$6,Assumptions!E$7,IF('Provider Info'!$C$23=Assumptions!F$6,Assumptions!F$7,IF('Provider Info'!$C$23=Assumptions!G$6,Assumptions!G$7,IF('Provider Info'!$C$23=Assumptions!H$7,Assumptions!H$7,Assumptions!I$7))))))","v":"Quick access to RRH assistance"},{"$f":"IF('Provider Info'!$C$23=Assumptions!C$6,Assumptions!C$8,IF('Provider Info'!$C$23=Assumptions!D$6,Assumptions!D$8,IF('Provider Info'!$C$23=Assumptions!E$6,Assumptions!E$8,IF('Provider Info'!$C$23=Assumptions!F$6,Assumptions!F$8,IF('Provider Info'!$C$23=Assumptions!G$6,Assumptions!G$8,IF('Provider Info'!$C$23=Assumptions!H$6,Assumptions!H$8,Assumptions!I$8))))))","v":"A Rapid Re-housing project ensures quick linkage to rapid re-housing assistance, based on participant choice. "},null,"Please select answer","Please select answer","Please select answer"]
[null,null,null,"Optional notes here"]
[null,{"$f":"B7+1","v":2},{"$f":"IF('Provider Info'!$C$23=Assumptions!C$6,Assumptions!C$10,IF('Provider Info'!$C$23=Assumptions!D$6,Assumptions!D$10,IF('Provider Info'!$C$23=Assumptions!E$6,Assumptions!E$10,IF('Provider Info'!$C$23=Assumptions!F$6,Assumptions!F$10,IF('Provider Info'!$C$23=Assumptions!G$6,Assumptions!G$10,IF('Provider Info'!$C$23=Assumptions!H$6,Assumptions!H$10,Assumptions!I$10))))))","v":"RRH services support people in maintaining their housing"},{"$f":"IF('Provider Info'!$C$23=Assumptions!C$6,Assumptions!C$11,IF('Provider Info'!$C$23=Assumptions!D$6,Assumptions!D$11,IF('Provider Info'!$C$23=Assumptions!E$6,Assumptions!E$11,IF('Provider Info'!$C$23=Assumptions!F$6,Assumptions!F$11,IF('Provider Info'!$C$23=Assumptions!G$6,Assumptions!G$11,IF('Provider Info'!$C$23=Assumptions!H$6,Assumptions!H$11,Assumptions!I$11))))))","v":"Participants and staff understand that a primary goal of rapid re-housing is to end homelessness and move participants to permanent housing as quickly as possible, regardless of perceived barriers."},null,"Please select answer","Please select answer","Please select answer"]
[null,null,null,"Optional notes here"]
[null,{"$f":"B9+1","v":3},{"$f":"IF('Provider Info'!$C$23=Assumptions!C$6,Assumptions!C$13,IF('Provider Info'!$C$23=Assumptions!D$6,Assumptions!D$13,IF('Provider Info'!$C$23=Assumptions!E$6,Assumptions!E$13,IF('Provider Info'!$C$23=Assumptions!F$6,Assumptions!F$13,IF('Provider Info'!$C$23=Assumptions!G$6,Assumptions!G$13,IF('Provider Info'!$C$23=Assumptions!H$6,Assumptions!H$13,Assumptions!I$13))))))","v":"Providers continuously assess a participant’s need for assistance"},{"$f":"IF('Provider Info'!$C$23=Assumptions!C$6,Assumptions!C$14,IF('Provider Info'!$C$23=Assumptions!D$6,Assumptions!D$14,IF('Provider Info'!$C$23=Assumptions!E$6,Assumptions!E$14,IF('Provider Info'!$C$23=Assumptions!F$6,Assumptions!F$14,IF('Provider Info'!$C$23=Assumptions!G$6,Assumptions!G$14,IF('Provider Info'!$C$23=Assumptions!H$6,Assumptions!H$14,Assumptions!I$14))))))","v":"On an ongoing basis, providers assess a participant’s needs for continued assistance and provide tailored assistance based on those assessments."},null,"Please select answer","Please select answer","Please select answer"]
[null,null,null,"Optional notes here"]
[null,{"$f":"IF(D13=\"No additional standards\",\"\",B11+1)","v":4},{"$f":"IF('Provider Info'!$C$23=Assumptions!C$6,Assumptions!C$16,IF('Provider Info'!$C$23=Assumptions!D$6,Assumptions!D$16,IF('Provider Info'!$C$23=Assumptions!E$6,Assumptions!E$16,IF('Provider Info'!$C$23=Assumptions!F$6,Assumptions!F$16,IF('Provider Info'!$C$23=Assumptions!G$6,Assumptions!G$16,IF('Provider Info'!$C$23=Assumptions!H$6,Assumptions!H$16,Assumptions!I$16))))))","v":"Transitional housing is focused on safe and quick transitions to permanent housing"},{"$f":"IF('Provider Info'!$C$23=Assumptions!C$6,Assumptions!C$17,IF('Provider Info'!$C$23=Assumptions!D$6,Assumptions!D$17,IF('Provider Info'!$C$23=Assumptions!E$6,Assumptions!E$17,IF('Provider Info'!$C$23=Assumptions!F$6,Assumptions!F$17,IF('Provider Info'!$C$23=Assumptions!G$6,Assumptions!G$17,IF('Provider Info'!$C$23=Assumptions!H$6,Assumptions!H$17,Assumptions!I$17))))))","v":"Participants and staff understand that the primary goals of transitional housing are to provide temporary accommodations that are safe, respectful, and responsive to individual needs, address the services needs of participants, and re-house participants in permanent housing as quickly as possible, regardless of other personal issues or concerns, and as desired by the participant. Participation in transitional housing services does not inhibit participants from moving to permanent housing when they choose to. Assessment and planning for permanent housing placement begins as soon as the individual or family expresses a desire to transition to permanent housing."},null,"Please select answer","Please select answer","Please select answer"]
[null,null,null,"Optional notes here"]
[null,{"$f":"IF(D15=\"No additional standards\",\"\",B13+1)","v":5},{"$f":"IF('Provider Info'!$C$23=Assumptions!C$6,Assumptions!C$19,IF('Provider Info'!$C$23=Assumptions!D$6,Assumptions!D$19,IF('Provider Info'!$C$23=Assumptions!E$6,Assumptions!E$19,IF('Provider Info'!$C$23=Assumptions!F$6,Assumptions!F$19,IF('Provider Info'!$C$23=Assumptions!G$6,Assumptions!G$19,IF('Provider Info'!$C$23=Assumptions!H$6,Assumptions!H$19,Assumptions!I$19))))))","v":"TH projects provide appropriate services"},{"$f":"IF('Provider Info'!$C$23=Assumptions!C$6,Assumptions!C$20,IF('Provider Info'!$C$23=Assumptions!D$6,Assumptions!D$20,IF('Provider Info'!$C$23=Assumptions!E$6,Assumptions!E$20,IF('Provider Info'!$C$23=Assumptions!F$6,Assumptions!F$20,IF('Provider Info'!$C$23=Assumptions!G$6,Assumptions!G$20,IF('Provider Info'!$C$23=Assumptions!H$6,Assumptions!H$20,Assumptions!I$20))))))","v":"TH projects provide appropriate services to meet the participants health and safety needs (e.g., persons in early recovery; domestic violence survivors; those who need special accommodations) when there are no permanent housing solutions available (with or without supportive services) or when the participant chooses transitional housing. Services are not required in order to participate in housing."},null,"Please select answer","Please select answer","Please select answer"]
[null,null,null,"Optional notes here"]
[null,{"$f":"IF(D17=\"No additional standards\",\"\",B15+1)","v":""},{"$f":"IF('Provider Info'!$C$23=Assumptions!C$6,Assumptions!C$22,IF('Provider Info'!$C$23=Assumptions!D$6,Assumptions!D$22,IF('Provider Info'!$C$23=Assumptions!E$6,Assumptions!E$22,IF('Provider Info'!$C$23=Assumptions!F$6,Assumptions!F$22,IF('Provider Info'!$C$23=Assumptions!G$6,Assumptions!G$22,IF('Provider Info'!$C$23=Assumptions!H$6,Assumptions!H$22,Assumptions!I$22))))))","v":" "},{"$f":"IF('Provider Info'!$C$23=Assumptions!C$6,Assumptions!C$23,IF('Provider Info'!$C$23=Assumptions!D$6,Assumptions!D$23,IF('Provider Info'!$C$23=Assumptions!E$6,Assumptions!E$23,IF('Provider Info'!$C$23=Assumptions!F$6,Assumptions!F$23,IF('Provider Info'!$C$23=Assumptions!G$6,Assumptions!G$23,IF('Provider Info'!$C$23=Assumptions!H$6,Assumptions!H$23,Assumptions!I$23))))))","v":"No additional standards"},null,"Please select answer","Please select answer","Please select answer"]
[null,null,null,"Optional notes here"]
[null,{"$f":"IF(D19=\"No additional standards\",\"\",B17+1)","v":""},{"$f":"IF('Provider Info'!$C$23=Assumptions!C$6,Assumptions!C$25,IF('Provider Info'!$C$23=Assumptions!D$6,Assumptions!D$25,IF('Provider Info'!$C$23=Assumptions!E$6,Assumptions!E$25,IF('Provider Info'!$C$23=Assumptions!F$6,Assumptions!F$25,IF('Provider Info'!$C$23=Assumptions!G$6,Assumptions!G$25,IF('Provider Info'!$C$23=Assumptions!H$6,Assumptions!H$25,Assumptions!I$25))))))","v":" "},{"$f":"IF('Provider Info'!$C$23=Assumptions!C$6,Assumptions!C$26,IF('Provider Info'!$C$23=Assumptions!D$6,Assumptions!D$26,IF('Provider Info'!$C$23=Assumptions!E$6,Assumptions!E$26,IF('Provider Info'!$C$23=Assumptions!F$6,Assumptions!F$26,IF('Provider Info'!$C$23=Assumptions!G$6,Assumptions!G$26,IF('Provider Info'!$C$23=Assumptions!H$6,Assumptions!H$26,Assumptions!I$26))))))","v":"No additional standards"},null,"Please select answer","Please select answer","Please select answer"]
[null,null,null,"Optional notes here"]
[null,{"$f":"IF(D21=\"No additional standards\",\"\",B19+1)","v":""},{"$f":"IF('Provider Info'!$C$23=Assumptions!C$6,Assumptions!C$28,IF('Provider Info'!$C$23=Assumptions!D$6,Assumptions!D$28,IF('Provider Info'!$C$23=Assumptions!E$6,Assumptions!E$28,IF('Provider Info'!$C$23=Assumptions!F$6,Assumptions!F$28,IF('Provider Info'!$C$23=Assumptions!G$6,Assumptions!G$28,IF('Provider Info'!$C$23=Assumptions!H$6,Assumptions!H$28,Assumptions!I$28))))))","v":" "},{"$f":"IF('Provider Info'!$C$23=Assumptions!C$6,Assumptions!C$29,IF('Provider Info'!$C$23=Assumptions!D$6,Assumptions!D$29,IF('Provider Info'!$C$23=Assumptions!E$6,Assumptions!E$29,IF('Provider Info'!$C$23=Assumptions!F$6,Assumptions!F$29,IF('Provider Info'!$C$23=Assumptions!G$6,Assumptions!G$29,IF('Provider Info'!$C$23=Assumptions!H$6,Assumptions!H$29,Assumptions!I$29))))))","v":"No additional standards"},null,"Please select answer","Please select answer","Please select answer"]
[null,null,null,"Optional notes here"]
[null,null,{"$f":"IF('Provider Info'!$C$26=\"None of the above\",\"\",\"Standard\")","v":"Standard"},{"$f":"IF('Provider Info'!$C$26=\"None of the above\",\"Section is not applicable. Please see following section.\",\"Population Specific Standards\")","v":"Population Specific Standards"},null,{"$f":"IF('Provider Info'!$C$26=\"None of the above\",\"\",\"Say It\")","v":"Say It"},{"$f":"IF('Provider Info'!$C$26=\"None of the above\",\"\",\"Document It\")","v":"Document It"},{"$f":"IF('Provider Info'!$C$26=\"None of the above\",\"\",\"Do It\")","v":"Do It"}]
[null,1,{"$f":"IF('Provider Info'!$C$26=\"None of the above\",\"\",IF('Provider Info'!$C$26=Assumptions!L$6,Assumptions!L$7,IF('Provider Info'!$C$26=Assumptions!M$6,Assumptions!M$7,Assumptions!N$7)))","v":"Recovery housing is offered as one choice among other housing opportunities"},{"$f":"IF('Provider Info'!$C$26=\"None of the above\",\"Not applicable\",IF('Provider Info'!$C$26=Assumptions!L$6,Assumptions!L$8,IF('Provider Info'!$C$26=Assumptions!M$6,Assumptions!M$8,Assumptions!N$8)))","v":"Connection to recovery housing reflects individual choice for this path toward recovery. Abstinence-only spaces are incorporated into a Housing First model wherever possible, thus providing this type of recovery option to those who choose it. Recovery supports are offered, particularly connections to community-based treatment options."},null,"Please select answer","Please select answer","Please select answer"]
[null,null,null,"Optional notes here"]
[null,{"$f":"B24+1","v":2},{"$f":"IF('Provider Info'!$C$26=\"None of the C29above\",\"\",IF('Provider Info'!$C$26=Assumptions!L$6,Assumptions!L$10,IF('Provider Info'!$C$26=Assumptions!M$6,Assumptions!M$10,Assumptions!N$10)))","v":"Services include relapse support"},{"$f":"IF('Provider Info'!$C$26=\"None of the above\",\"Not applicable\",IF('Provider Info'!$C$26=Assumptions!L$6,Assumptions!L$11,IF('Provider Info'!$C$26=Assumptions!M$6,Assumptions!M$11,Assumptions!N$11)))","v":"Housing and services include relapse support that does not automatically evict or discharge a participant from the project for temporary relapse. Relapse support might  include referrals to outpatient treatment or direct provision of outpatient services or the ability to hold a unit for a certain period of time (30-90 days) while the participant undergoes residential treatment."},null,"Please select answer","Please select answer","Please select answer"]
[null,null,null,"Optional notes here"]
[null,{"$f":"B26+1","v":3},{"$f":"IF('Provider Info'!$C$26=\"None of the above\",\"\",IF('Provider Info'!$C$26=Assumptions!L$6,Assumptions!L$13,IF('Provider Info'!$C$26=Assumptions!M$6,Assumptions!M$13,Assumptions!N$13)))","v":"Services support sustained recovery"},{"$f":"IF('Provider Info'!$C$26=\"None of the above\",\"Not applicable\",IF('Provider Info'!$C$26=Assumptions!L$6,Assumptions!L$14,IF('Provider Info'!$C$26=Assumptions!M$6,Assumptions!M$14,Assumptions!N$14)))","v":"Recovery housing projects provide services that align with participants’ choice and prioritization of recovery, including but not limited to abstinence from substances (if that is a personal goal), long-term permanent housing stability, and stable income through employment or benefits. Support is offered through connections to community-based treatment options."},null,"Please select answer","Please select answer","Please select answer"]
[null,null,null,"Optional notes here"]
[null,{"$f":"B28+1","v":4},{"$f":"IF('Provider Info'!$C$26=\"None of the above\",\"\",IF('Provider Info'!$C$26=Assumptions!L$6,Assumptions!L$16,IF('Provider Info'!$C$26=Assumptions!M$6,Assumptions!M$16,Assumptions!N$16)))","v":0},{"$f":"IF('Provider Info'!$C$26=\"None of the above\",\"Not applicable\",IF('Provider Info'!$C$26=Assumptions!L$6,Assumptions!L$17,IF('Provider Info'!$C$26=Assumptions!M$6,Assumptions!M$17,Assumptions!N$17)))","v":"No additional standards"},null,"Please select answer","Please select answer","Please select answer"]
[null,null,null,"Optional notes here"]

{"sheet":"Report Summary","index":6,"n_rows":69,"n_cols":16,"rows_kept":69,"cut":false,"hidden":false,"merged":[[68,4,68,7],[52,4,52,7],[54,4,54,7],[56,4,56,7],[58,4,58,7],[60,4,60,7],[59,4,59,7],[57,4,57,7],[62,4,62,7],[64,4,64,7],[66,4,66,7],[63,4,63,7],[65,4,65,7],[67,4,67,7],[61,4,61,7],[75,3,75,7],[69,3,69,7],[70,3,70,7],[71,3,71,7],[72,3,72,7],[73,3,73,7],[74,3,74,7],[6,1,6,7],[51,4,51,7],[53,4,53,7],[55,4,55,7],[50,4,50,7],[41,4,41,7],[43,4,43,7],[45,4,45,7],[47,4,47,7],[42,4,42,7],[44,4,44,7],[46,4,46,7],[48,4,48,7],[49,4,49,7]]}
[null,"Housing First Standards: Assessment Summary"]
[]
[null,{"$f":"'Provider Info'!C6","v":"[Test Provider]"}]
[null,{"$f":"'Provider Info'!C44","v":"2016-11-02"}]
[]
[]
[null,{"$f":"IF(SUM('Scratch - Report'!$C$7,'Scratch - Report'!$F$7,'Scratch - Report'!$I$7,'Scratch - Report'!$L$7,'Scratch - Report'!$O$7,'Scratch - Report'!$R$7,'Scratch - Report'!$U$7)=0,\"\",\"Some standards have not been evaluated. Please return and complete all standards before finalizing report.\")","v":"Some standards have not been evaluated. Please return and complete all standards before finalizing report."}]
[]
[]
[null,"Your score:",{"$f":"'Scratch - Report'!F46","v":0}]
[null,"Max potential score:",{"$f":"'Scratch - Report'!C75","v":216}]
[]
[]
[]
[]
[]
[]
[]
[]
[]
[]
[]
[]
[]
[]
[]
[]
[]
[]
[]
[]
[]
[]
[]
[]
[]
[]
[]
[]
[null,"Non-Compliant Standards (\"Not at all\" to Whether Standard is Said)",null,null,null,null,null,null,"Non-Documented Standards (\"Not at All\" to Whether Standard is Documented)",null,null,null,"Non-Evidenced Standards (\"Not at All\" to Whether Standard is Done\")"]
[null,"Category","No.","Name","Standard",null,null,null,"Category","No.","Name","Standard","Category","No.","Name","Standard"]
[null,{"$f":"'Scratch - List'!I2","v":""},{"$f":"'Scratch - List'!J2","v":""},{"$f":"'Scratch - List'!K2","v":""},{"$f":"'Scratch - List'!L2","v":""},null,null,null,{"$f":"'Scratch - List'!Q2","v":""},{"$f":"'Scratch - List'!O2","v":""},{"$f":"'Scratch - List'!P2","v":""},{"$f":"'Scratch - List'!N2","v":""},{"$f":"'Scratch - List'!V2","v":""},{"$f":"'Scratch - List'!T2","v":""},{"$f":"'Scratch - List'!U2","v":""},{"$f":"'Scratch - List'!S2","v":""}]
[null,null,null,null,{"$f":"'Scratch - List'!M2","v":""},null,null,null,null,null,null,{"$f":"'Scratch - List'!R2","v":""},null,null,null,{"$f":"'Scratch - List'!W2","v":""}]
[null,{"$f":"'Scratch - List'!I3","v":""},{"$f":"'Scratch - List'!J3","v":""},{"$f":"'Scratch - List'!K4","v":""},{"$f":"'Scratch - List'!L3","v":""},null,null,null,{"$f":"'Scratch - List'!Q3","v":""},{"$f":"'Scratch - List'!O3","v":""},{"$f":"'Scratch - List'!P3","v":""},{"$f":"'Scratch - List'!N3","v":""},{"$f":"'Scratch - List'!V3","v":""},{"$f":"'Scratch - List'!T3","v":""},{"$f":"'Scratch - List'!U3","v":""},{"$f":"'Scratch - List'!S3","v":""}]
[null,null,null,null,{"$f":"'Scratch - List'!M3","v":""},null,null,null,null,null,null,{"$f":"'Scratch - List'!R3","v":""},null,null,null,{"$f":"'Scratch - List'!W3","v":""}]
[null,{"$f":"'Scratch - List'!I4","v":""},{"$f":"'Scratch - List'!J4","v":""},{"$f":"'Scratch - List'!K4","v":""},{"$f":"'Scratch - List'!L4","v":""},null,null,null,{"$f":"'Scratch - List'!Q4","v":""},{"$f":"'Scratch - List'!O4","v":""},{"$f":"'Scratch - List'!P4","v":""},{"$f":"'Scratch - List'!N4","v":""},{"$f":"'Scratch - List'!V4","v":""},{"$f":"'Scratch - List'!T4","v":""},{"$f":"'Scratch - List'!U4","v":""},{"$f":"'Scratch - List'!S4","v":""}]
[null,null,null,null,{"$f":"'Scratch - List'!M4","v":""},null,null,null,null,null,null,{"$f":"'Scratch - List'!R4","v":""},null,null,null,{"$f":"'Scratch - List'!W4","v":""}]
[null,{"$f":"'Scratch - List'!I5","v":""},{"$f":"'Scratch - List'!J5","v":""},{"$f":"'Scratch - List'!K5","v":""},{"$f":"'Scratch - List'!L5","v":""},null,null,null,{"$f":"'Scratch - List'!Q5","v":""},{"$f":"'Scratch - List'!O5","v":""},{"$f":"'Scratch - List'!P5","v":""},{"$f":"'Scratch - List'!N5","v":""},{"$f":"'Scratch - List'!V5","v":""},{"$f":"'Scratch - List'!T5","v":""},{"$f":"'Scratch - List'!U5","v":""},{"$f":"'Scratch - List'!S5","v":""}]
[null,null,null,null,{"$f":"'Scratch - List'!M5","v":""},null,null,null,null,null,null,{"$f":"'Scratch - List'!R5","v":""},null,null,null,{"$f":"'Scratch - List'!W5","v":""}]
[null,{"$f":"'Scratch - List'!I6","v":""},{"$f":"'Scratch - List'!J6","v":""},{"$f":"'Scratch - List'!K6","v":""},{"$f":"'Scratch - List'!L6","v":""},null,null,null,{"$f":"'Scratch - List'!Q6","v":""},{"$f":"'Scratch - List'!O6","v":""},{"$f":"'Scratch - List'!P6","v":""},{"$f":"'Scratch - List'!N6","v":""},{"$f":"'Scratch - List'!V6","v":""},{"$f":"'Scratch - List'!T6","v":""},{"$f":"'Scratch - List'!U6","v":""},{"$f":"'Scratch - List'!S6","v":""}]
[null,null,null,null,{"$f":"'Scratch - List'!M6","v":""},null,null,null,null,null,null,{"$f":"'Scratch - List'!R6","v":""},null,null,null,{"$f":"'Scratch - List'!W6","v":""}]
[null,{"$f":"'Scratch - List'!I7","v":""},{"$f":"'Scratch - List'!J7","v":""},{"$f":"'Scratch - List'!K7","v":""},{"$f":"'Scratch - List'!L7","v":""},null,null,null,{"$f":"'Scratch - List'!Q7","v":""},{"$f":"'Scratch - List'!O7","v":""},{"$f":"'Scratch - List'!P7","v":""},{"$f":"'Scratch - List'!N7","v":""},{"$f":"'Scratch - List'!V7","v":""},{"$f":"'Scratch - List'!T7","v":""},{"$f":"'Scratch - List'!U7","v":""},{"$f":"'Scratch - List'!S7","v":""}]
[null,null,null,null,{"$f":"'Scratch - List'!M7","v":""},null,null,null,null,null,null,{"$f":"'Scratch - List'!R7","v":""},null,null,null,{"$f":"'Scratch - List'!W7","v":""}]
[null,{"$f":"'Scratch - List'!I8","v":""},{"$f":"'Scratch - List'!J8","v":""},{"$f":"'Scratch - List'!K8","v":""},{"$f":"'Scratch - List'!L8","v":""},null,null,null,{"$f":"'Scratch - List'!Q8","v":""},{"$f":"'Scratch - List'!O8","v":""},{"$f":"'Scratch - List'!P8","v":""},{"$f":"'Scratch - List'!N8","v":""},{"$f":"'Scratch - List'!V8","v":""},{"$f":"'Scratch - List'!T8","v":""},{"$f":"'Scratch - List'!U8","v":""},{"$f":"'Scratch - List'!S8","v":""}]
[null,null,null,null,{"$f":"'Scratch - List'!M8","v":""},null,null,null,null,null,null,{"$f":"'Scratch - List'!R8","v":""},null,null,null,{"$f":"'Scratch - List'!W8","v":""}]
[null,{"$f":"'Scratch - List'!I9","v":""},{"$f":"'Scratch - List'!J9","v":""},{"$f":"'Scratch - List'!K9","v":""},{"$f":"'Scratch - List'!L9","v":""},null,null,null,{"$f":"'Scratch - List'!Q9","v":""},{"$f":"'Scratch - List'!O9","v":""},{"$f":"'Scratch - List'!P9","v":""},{"$f":"'Scratch - List'!N9","v":""},{"$f":"'Scratch - List'!V9","v":""},{"$f":"'Scratch - List'!T9","v":""},{"$f":"'Scratch - List'!U9","v":""},{"$f":"'Scratch - List'!S9","v":""}]
[null,null,null,null,{"$f":"'Scratch - List'!M9","v":""},null,null,null,null,null,null,{"$f":"'Scratch - List'!R9","v":""},null,null,null,{"$f":"'Scratch - List'!W9","v":""}]
[null,{"$f":"'Scratch - List'!I10","v":""},{"$f":"'Scratch - List'!J10","v":""},{"$f":"'Scratch - List'!K10","v":""},{"$f":"'Scratch - List'!L10","v":""},null,null,null,{"$f":"'Scratch - List'!Q10","v":""},{"$f":"'Scratch - List'!O10","v":""},{"$f":"'Scratch - List'!P10","v":""},{"$f":"'Scratch - List'!N10","v":""},{"$f":"'Scratch - List'!V10","v":""},{"$f":"'Scratch - List'!T10","v":""},{"$f":"'Scratch - List'!U10","v":""},{"$f":"'Scratch - List'!S10","v":""}]
[null,null,null,null,{"$f":"'Scratch - List'!M10","v":""},null,null,null,null,null,null,{"$f":"'Scratch - List'!R10","v":""},null,null,null,{"$f":"'Scratch - List'!W10","v":""}]
[null,{"$f":"'Scratch - List'!I11","v":""},{"$f":"'Scratch - List'!J11","v":""},{"$f":"'Scratch - List'!K11","v":""},{"$f":"'Scratch - List'!L11","v":""},null,null,null,{"$f":"'Scratch - List'!Q11","v":""},{"$f":"'Scratch - List'!O11","v":""},{"$f":"'Scratch - List'!P11","v":""},{"$f":"'Scratch - List'!N11","v":""},{"$f":"'Scratch - List'!V11","v":""},{"$f":"'Scratch - List'!T11","v":""},{"$f":"'Scratch - List'!U11","v":""},{"$f":"'Scratch - List'!S11","v":""}]
[null,null,null,null,{"$f":"'Scratch - List'!M11","v":""},null,null,null,null,null,null,{"$f":"'Scratch - List'!R11","v":""},null,null,null,{"$f":"'Scratch - List'!W11","v":""}]
[null,{"$f":"'Scratch - List'!I12","v":""},{"$f":"'Scratch - List'!J12","v":""},{"$f":"'Scratch - List'!K12","v":""},{"$f":"'Scratch - List'!L12","v":""},null,null,null,{"$f":"'Scratch - List'!Q12","v":""},{"$f":"'Scratch - List'!O12","v":""},{"$f":"'Scratch - List'!P12","v":""},{"$f":"'Scratch - List'!N12","v":""},{"$f":"'Scratch - List'!V12","v":""},{"$f":"'Scratch - List'!T12","v":""},{"$f":"'Scratch - List'!U12","v":""},{"$f":"'Scratch - List'!S12","v":""}]
[null,null,null,null,{"$f":"'Scratch - List'!M12","v":""},null,null,null,null,null,null,{"$f":"'Scratch - List'!R12","v":""},null,null,null,{"$f":"'Scratch - List'!W12","v":""}]
[null,{"$f":"'Scratch - List'!I13","v":""},{"$f":"'Scratch - List'!J13","v":""},{"$f":"'Scratch - List'!K13","v":""},{"$f":"'Scratch - List'!L13","v":""},null,null,null,{"$f":"'Scratch - List'!Q13","v":""},{"$f":"'Scratch - List'!O13","v":""},{"$f":"'Scratch - List'!P13","v":""},{"$f":"'Scratch - List'!N13","v":""},{"$f":"'Scratch - List'!V13","v":""},{"$f":"'Scratch - List'!T13","v":""},{"$f":"'Scratch - List'!U13","v":""},{"$f":"'Scratch - List'!S13","v":""}]
[null,null,null,null,{"$f":"'Scratch - List'!M13","v":""},null,null,null,null,null,null,{"$f":"'Scratch - List'!R13","v":""},null,null,null,{"$f":"'Scratch - List'!W13","v":""}]
[null,{"$f":"'Scratch - List'!I14","v":""},{"$f":"'Scratch - List'!J14","v":""},{"$f":"'Scratch - List'!K14","v":""},{"$f":"'Scratch - List'!L14","v":""},null,null,null,{"$f":"'Scratch - List'!Q14","v":""},{"$f":"'Scratch - List'!O14","v":""},{"$f":"'Scratch - List'!P14","v":""},{"$f":"'Scratch - List'!N14","v":""},{"$f":"'Scratch - List'!V14","v":""},{"$f":"'Scratch - List'!T14","v":""},{"$f":"'Scratch - List'!U14","v":""},{"$f":"'Scratch - List'!S14","v":""}]
[null,null,null,null,{"$f":"'Scratch - List'!M14","v":""},null,null,null,null,null,null,{"$f":"'Scratch - List'!R14","v":""},null,null,null,{"$f":"'Scratch - List'!W14","v":""}]
[null,{"$f":"'Scratch - List'!I15","v":""},{"$f":"'Scratch - List'!J15","v":""},{"$f":"'Scratch - List'!K15","v":""},{"$f":"'Scratch - List'!L15","v":""},null,null,null,{"$f":"'Scratch - List'!Q15","v":""},{"$f":"'Scratch - List'!O15","v":""},{"$f":"'Scratch - List'!P15","v":""},{"$f":"'Scratch - List'!N15","v":""},{"$f":"'Scratch - List'!V15","v":""},{"$f":"'Scratch - List'!T15","v":""},{"$f":"'Scratch - List'!U15","v":""},{"$f":"'Scratch - List'!S15","v":""}]
[null,null,null,null,{"$f":"'Scratch - List'!M15","v":""},null,null,null,null,null,null,{"$f":"'Scratch - List'!R15","v":""},null,null,null,{"$f":"'Scratch - List'!W15","v":""}]

{"sheet":"Scratch - List","index":7,"n_rows":98,"n_cols":25,"rows_kept":98,"cut":false,"hidden":true,"merged":[]}
["Comply","Document","Evidence","No. ","Name","Standard","Category","Notes","Not at all",null,null,null,null,"Not at all",null,null,null,null,"Not at all"]
[{"$f":"'Access & Input'!F7","v":"Please select answer"},{"$f":"'Access & Input'!G7","v":"Please select answer"},{"$f":"'Access & Input'!H7","v":"Please select answer"},{"$f":"'Access & Input'!B7","v":1},{"$f":"'Access & Input'!C7","v":"Projects are low-barrier"},{"$f":"'Access & Input'!D7","v":"Admission to projects is not contingent on pre-requisites such as abstinence of substances, minimum income requirements, health or mental health history, medication adherence, age, criminal justice history, financial history, completion of treatment, participation in services, “housing readiness,” history or occurrence of victimization, survivor of sexual assault or an affiliated person of such a survivor or other unnecessary conditions unless required by law or funding source."},"Access",{"$f":"F3","v":"Optional notes here"},{"$f":"IF(ISERROR(INDEX($A$1:$G$79,SMALL(IF($A$1:$A$79=$I$1,ROW($A$1:$A$79)),ROW(1:1)),7)),\"\",INDEX($A$1:$G$79,SMALL(IF($A$1:$A$79=$I$1,ROW($A$1:$A$79)),ROW(1:1)),7))","v":""},{"$f":"IF(ISERROR(INDEX($A$1:$G$79,SMALL(IF($A$1:$A$79=$I$1,ROW($A$1:$A$79)),ROW(1:1)),4)),\"\",INDEX($A$1:$G$79,SMALL(IF($A$1:$A$79=$I$1,ROW($A$1:$A$79)),ROW(1:1)),4))","v":""},{"$f":"IF(ISERROR(INDEX($A$1:$G$79,SMALL(IF($A$1:$A$79=$I$1,ROW($A$1:$A$79)),ROW(1:1)),5)),\"\",INDEX($A$1:$G$79,SMALL(IF($A$1:$A$79=$I$1,ROW($A$1:$A$79)),ROW(1:1)),5))","v":""},{"$f":"IF(ISERROR(INDEX($A$1:$G$79,SMALL(IF($A$1:$A$79=$I$1,ROW($A$1:$A$79)),ROW(1:1)),6)),\"\",INDEX($A$1:$G$79,SMALL(IF($A$1:$A$79=$I$1,ROW($A$1:$A$79)),ROW(1:1)),6))","v":""},{"$f":"IF(ISERROR(INDEX($A$1:$H$79,SMALL(IF($A$1:$A$79=$I$1,ROW($A$1:$A$79)),ROW(1:1)),8)),\"\",INDEX($A$1:$H$79,SMALL(IF($A$1:$A$79=$I$1,ROW($A$1:$A$79)),ROW(1:1)),8))","v":""},{"$f":"IF(ISERROR(INDEX($A$1:$G$79,SMALL(IF($B$1:$B$79=$N$1,ROW($B$1:$B$79)),ROW(1:1)),6)),\"\",INDEX($A$1:$G$79,SMALL(IF($B$1:$B$79=$N$1,ROW($B$1:$B$79)),ROW(1:1)),6))","v":""},{"$f":"IF(ISERROR(INDEX($A$1:$G$79,SMALL(IF($B$1:$B$79=$N$1,ROW($B$1:$B$79)),ROW(1:1)),4)),\"\",INDEX($A$1:$G$79,SMALL(IF($B$1:$B$79=$N$1,ROW($B$1:$B$79)),ROW(1:1)),4))","v":""},{"$f":"IF(ISERROR(INDEX($A$1:$G$79,SMALL(IF($B$1:$B$79=$N$1,ROW($B$1:$B$79)),ROW(1:1)),5)),\"\",INDEX($A$1:$G$79,SMALL(IF($B$1:$B$79=$N$1,ROW($B$1:$B$79)),ROW(1:1)),5))","v":""},{"$f":"IF(ISERROR(INDEX($A$1:$G$79,SMALL(IF($B$1:$B$79=$N$1,ROW($B$1:$B$79)),ROW(1:1)),7)),\"\",INDEX($A$1:$G$79,SMALL(IF($B$1:$B$79=$N$1,ROW($B$1:$B$79)),ROW(1:1)),7))","v":""},{"$f":"IF(ISERROR(INDEX($A$1:$H$79,SMALL(IF($B$1:$B$79=$N$1,ROW($B$1:$B$79)),ROW(1:1)),8)),\"\",INDEX($A$1:$H$79,SMALL(IF($B$1:$B$79=$N$1,ROW($B$1:$B$79)),ROW(1:1)),8))","v":""},{"$f":"IF(ISERROR(INDEX($A$1:$G$79,SMALL(IF($C$1:$C$79=$S$1,ROW($C$1:$C$79)),ROW(1:1)),6)),\"\",INDEX($A$1:$G$79,SMALL(IF($C$1:$C$79=$S$1,ROW($C$1:$C$79)),ROW(1:1)),6))","v":""},{"$f":"IF(ISERROR(INDEX($A$1:$G$79,SMALL(IF($C$1:$C$79=$S$1,ROW($C$1:$C$79)),ROW(1:1)),4)),\"\",INDEX($A$1:$G$79,SMALL(IF($C$1:$C$79=$S$1,ROW($C$1:$C$79)),ROW(1:1)),4))","v":""},{"$f":"IF(ISERROR(INDEX($A$1:$G$79,SMALL(IF($C$1:$C$79=$S$1,ROW($C$1:$C$79)),ROW(1:1)),5)),\"\",INDEX($A$1:$G$79,SMALL(IF($C$1:$C$79=$S$1,ROW($C$1:$C$79)),ROW(1:1)),5))","v":""},{"$f":"IF(ISERROR(INDEX($A$1:$G$79,SMALL(IF($C$1:$C$79=$S$1,ROW($C$1:$C$79)),ROW(1:1)),7)),\"\",INDEX($A$1:$G$79,SMALL(IF($C$1:$C$79=$S$1,ROW($C$1:$C$79)),ROW(1:1)),7))","v":""},{"$f":"IF(ISERROR(INDEX($A$1:$H$79,SMALL(IF($C$1:$C$79=$S$1,ROW($C$1:$C$79)),ROW(1:1)),8)),\"\",INDEX($A$1:$H$79,SMALL(IF($C$1:$C$79=$S$1,ROW($C$1:$C$79)),ROW(1:1)),8))","v":""}," ","Order of columns:"]
[{"$f":"'Access & Input'!F8","v":0},{"$f":"'Access & Input'!G8","v":0},{"$f":"'Access & Input'!H8","v":0},{"$f":"'Access & Input'!B8","v":0},{"$f":"'Access & Input'!C8","v":0},{"$f":"'Access & Input'!D8","v":"Optional notes here"},"Access",0,{"$f":"IF(ISERROR(INDEX($A$1:$G$79,SMALL(IF($A$1:$A$79=$I$1,ROW($A$1:$A$79)),ROW(2:2)),7)),\"\",INDEX($A$1:$G$79,SMALL(IF($A$1:$A$79=$I$1,ROW($A$1:$A$79)),ROW(2:2)),7))","v":""},{"$f":"IF(ISERROR(INDEX($A$1:$G$79,SMALL(IF($A$1:$A$79=$I$1,ROW($A$1:$A$79)),ROW(2:2)),4)),\"\",INDEX($A$1:$G$79,SMALL(IF($A$1:$A$79=$I$1,ROW($A$1:$A$79)),ROW(2:2)),4))","v":""},{"$f":"IF(ISERROR(INDEX($A$1:$G$79,SMALL(IF($A$1:$A$79=$I$1,ROW($A$1:$A$79)),ROW(2:2)),5)),\"\",INDEX($A$1:$G$79,SMALL(IF($A$1:$A$79=$I$1,ROW($A$1:$A$79)),ROW(2:2)),5))","v":""},{"$f":"IF(ISERROR(INDEX($A$1:$G$79,SMALL(IF($A$1:$A$79=$I$1,ROW($A$1:$A$79)),ROW(2:2)),6)),\"\",INDEX($A$1:$G$79,SMALL(IF($A$1:$A$79=$I$1,ROW($A$1:$A$79)),ROW(2:2)),6))","v":""},{"$f":"IF(ISERROR(INDEX($A$1:$H$79,SMALL(IF($A$1:$A$79=$I$1,ROW($A$1:$A$79)),ROW(2:2)),8)),\"\",INDEX($A$1:$H$79,SMALL(IF($A$1:$A$79=$I$1,ROW($A$1:$A$79)),ROW(2:2)),8))","v":""},{"$f":"IF(ISERROR(INDEX($A$1:$G$79,SMALL(IF($B$1:$B$79=$N$1,ROW($B$1:$B$79)),ROW(2:2)),6)),\"\",INDEX($A$1:$G$79,SMALL(IF($B$1:$B$79=$N$1,ROW($B$1:$B$79)),ROW(2:2)),6))","v":""},{"$f":"IF(ISERROR(INDEX($A$1:$G$79,SMALL(IF($B$1:$B$79=$N$1,ROW($B$1:$B$79)),ROW(2:2)),4)),\"\",INDEX($A$1:$G$79,SMALL(IF($B$1:$B$79=$N$1,ROW($B$1:$B$79)),ROW(2:2)),4))","v":""},{"$f":"IF(ISERROR(INDEX($A$1:$G$79,SMALL(IF($B$1:$B$79=$N$1,ROW($B$1:$B$79)),ROW(2:2)),5)),\"\",INDEX($A$1:$G$79,SMALL(IF($B$1:$B$79=$N$1,ROW($B$1:$B$79)),ROW(2:2)),5))","v":""},{"$f":"IF(ISERROR(INDEX($A$1:$G$79,SMALL(IF($B$1:$B$79=$N$1,ROW($B$1:$B$79)),ROW(2:2)),7)),\"\",INDEX($A$1:$G$79,SMALL(IF($B$1:$B$79=$N$1,ROW($B$1:$B$79)),ROW(2:2)),7))","v":""},{"$f":"IF(ISERROR(INDEX($A$1:$H$79,SMALL(IF($B$1:$B$79=$N$1,ROW($B$1:$B$79)),ROW(2:2)),8)),\"\",INDEX($A$1:$H$79,SMALL(IF($B$1:$B$79=$N$1,ROW($B$1:$B$79)),ROW(2:2)),8))","v":""},{"$f":"IF(ISERROR(INDEX($A$1:$G$79,SMALL(IF($C$1:$C$79=$S$1,ROW($C$1:$C$79)),ROW(2:2)),6)),\"\",INDEX($A$1:$G$79,SMALL(IF($C$1:$C$79=$S$1,ROW($C$1:$C$79)),ROW(2:2)),6))","v":""},{"$f":"IF(ISERROR(INDEX($A$1:$G$79,SMALL(IF($C$1:$C$79=$S$1,ROW($C$1:$C$79)),ROW(2:2)),4)),\"\",INDEX($A$1:$G$79,SMALL(IF($C$1:$C$79=$S$1,ROW($C$1:$C$79)),ROW(2:2)),4))","v":""},{"$f":"IF(ISERROR(INDEX($A$1:$G$79,SMALL(IF($C$1:$C$79=$S$1,ROW($C$1:$C$79)),ROW(2:2)),5)),\"\",INDEX($A$1:$G$79,SMALL(IF($C$1:$C$79=$S$1,ROW($C$1:$C$79)),ROW(2:2)),5))","v":""},{"$f":"IF(ISERROR(INDEX($A$1:$G$79,SMALL(IF($C$1:$C$79=$S$1,ROW($C$1:$C$79)),ROW(2:2)),7)),\"\",INDEX($A$1:$G$79,SMALL(IF($C$1:$C$79=$S$1,ROW($C$1:$C$79)),ROW(2:2)),7))","v":""},{"$f":"IF(ISERROR(INDEX($A$1:$H$79,SMALL(IF($C$1:$C$79=$S$1,ROW($C$1:$C$79)),ROW(2:2)),8)),\"\",INDEX($A$1:$H$79,SMALL(IF($C$1:$C$79=$S$1,ROW($C$1:$C$79)),ROW(2:2)),8))","v":""}," ","Non compliant (G-I)"]
[{"$f":"'Access & Input'!F9","v":"Please select answer"},{"$f":"'Access & Input'!G9","v":"Please select answer"},{"$f":"'Access & Input'!H9","v":"Please select answer"},{"$f":"'Access & Input'!B9","v":2},{"$f":"'Access & Input'!C9","v":"Projects do not deny assistance for unnecessary reasons"},{"$f":"'Access & Input'!D9","v":"Procedures and oversight demonstrate that staff do everything possible to avoid denying assistance or rejecting an individual or family for the reasons listed in Access Standard #1.  "},"Access",{"$f":"F5","v":"Optional notes here"},{"$f":"IF(ISERROR(INDEX($A$1:$G$79,SMALL(IF($A$1:$A$79=$I$1,ROW($A$1:$A$79)),ROW(3:3)),7)),\"\",INDEX($A$1:$G$79,SMALL(IF($A$1:$A$79=$I$1,ROW($A$1:$A$79)),ROW(3:3)),7))","v":""},{"$f":"IF(ISERROR(INDEX($A$1:$G$79,SMALL(IF($A$1:$A$79=$I$1,ROW($A$1:$A$79)),ROW(3:3)),4)),\"\",INDEX($A$1:$G$79,SMALL(IF($A$1:$A$79=$I$1,ROW($A$1:$A$79)),ROW(3:3)),4))","v":""},{"$f":"IF(ISERROR(INDEX($A$1:$G$79,SMALL(IF($A$1:$A$79=$I$1,ROW($A$1:$A$79)),ROW(3:3)),5)),\"\",INDEX($A$1:$G$79,SMALL(IF($A$1:$A$79=$I$1,ROW($A$1:$A$79)),ROW(3:3)),5))","v":""},{"$f":"IF(ISERROR(INDEX($A$1:$G$79,SMALL(IF($A$1:$A$79=$I$1,ROW($A$1:$A$79)),ROW(3:3)),6)),\"\",INDEX($A$1:$G$79,SMALL(IF($A$1:$A$79=$I$1,ROW($A$1:$A$79)),ROW(3:3)),6))","v":""},{"$f":"IF(ISERROR(INDEX($A$1:$H$79,SMALL(IF($A$1:$A$79=$I$1,ROW($A$1:$A$79)),ROW(3:3)),8)),\"\",INDEX($A$1:$H$79,SMALL(IF($A$1:$A$79=$I$1,ROW($A$1:$A$79)),ROW(3:3)),8))","v":""},{"$f":"IF(ISERROR(INDEX($A$1:$G$79,SMALL(IF($B$1:$B$79=$N$1,ROW($B$1:$B$79)),ROW(3:3)),6)),\"\",INDEX($A$1:$G$79,SMALL(IF($B$1:$B$79=$N$1,ROW($B$1:$B$79)),ROW(3:3)),6))","v":""},{"$f":"IF(ISERROR(INDEX($A$1:$G$79,SMALL(IF($B$1:$B$79=$N$1,ROW($B$1:$B$79)),ROW(3:3)),4)),\"\",INDEX($A$1:$G$79,SMALL(IF($B$1:$B$79=$N$1,ROW($B$1:$B$79)),ROW(3:3)),4))","v":""},{"$f":"IF(ISERROR(INDEX($A$1:$G$79,SMALL(IF($B$1:$B$79=$N$1,ROW($B$1:$B$79)),ROW(3:3)),5)),\"\",INDEX($A$1:$G$79,SMALL(IF($B$1:$B$79=$N$1,ROW($B$1:$B$79)),ROW(3:3)),5))","v":""},{"$f":"IF(ISERROR(INDEX($A$1:$G$79,SMALL(IF($B$1:$B$79=$N$1,ROW($B$1:$B$79)),ROW(3:3)),7)),\"\",INDEX($A$1:$G$79,SMALL(IF($B$1:$B$79=$N$1,ROW($B$1:$B$79)),ROW(3:3)),7))","v":""},{"$f":"IF(ISERROR(INDEX($A$1:$H$79,SMALL(IF($B$1:$B$79=$N$1,ROW($B$1:$B$79)),ROW(3:3)),8)),\"\",INDEX($A$1:$H$79,SMALL(IF($B$1:$B$79=$N$1,ROW($B$1:$B$79)),ROW(3:3)),8))","v":""},{"$f":"IF(ISERROR(INDEX($A$1:$G$79,SMALL(IF($C$1:$C$79=$S$1,ROW($C$1:$C$79)),ROW(3:3)),6)),\"\",INDEX($A$1:$G$79,SMALL(IF($C$1:$C$79=$S$1,ROW($C$1:$C$79)),ROW(3:3)),6))","v":""},{"$f":"IF(ISERROR(INDEX($A$1:$G$79,SMALL(IF($C$1:$C$79=$S$1,ROW($C$1:$C$79)),ROW(3:3)),4)),\"\",INDEX($A$1:$G$79,SMALL(IF($C$1:$C$79=$S$1,ROW($C$1:$C$79)),ROW(3:3)),4))","v":""},{"$f":"IF(ISERROR(INDEX($A$1:$G$79,SMALL(IF($C$1:$C$79=$S$1,ROW($C$1:$C$79)),ROW(3:3)),5)),\"\",INDEX($A$1:$G$79,SMALL(IF($C$1:$C$79=$S$1,ROW($C$1:$C$79)),ROW(3:3)),5))","v":""},{"$f":"IF(ISERROR(INDEX($A$1:$G$79,SMALL(IF($C$1:$C$79=$S$1,ROW($C$1:$C$79)),ROW(3:3)),7)),\"\",INDEX($A$1:$G$79,SMALL(IF($C$1:$C$79=$S$1,ROW($C$1:$C$79)),ROW(3:3)),7))","v":""},{"$f":"IF(ISERROR(INDEX($A$1:$H$79,SMALL(IF($C$1:$C$79=$S$1,ROW($C$1:$C$79)),ROW(3:3)),8)),\"\",INDEX($A$1:$H$79,SMALL(IF($C$1:$C$79=$S$1,ROW($C$1:$C$79)),ROW(3:3)),8))","v":""}," ","Non-documented (J-L)"]
[{"$f":"'Access & Input'!F10","v":0},{"$f":"'Access & Input'!G10","v":0},{"$f":"'Access & Input'!H10","v":0},{"$f":"'Access & Input'!B10","v":0},{"$f":"'Access & Input'!C10","v":0},{"$f":"'Access & Input'!D10","v":"Optional notes here"},"Access",0,{"$f":"IF(ISERROR(INDEX($A$1:$G$79,SMALL(IF($A$1:$A$79=$I$1,ROW($A$1:$A$79)),ROW(4:4)),7)),\"\",INDEX($A$1:$G$79,SMALL(IF($A$1:$A$79=$I$1,ROW($A$1:$A$79)),ROW(4:4)),7))","v":""},{"$f":"IF(ISERROR(INDEX($A$1:$G$79,SMALL(IF($A$1:$A$79=$I$1,ROW($A$1:$A$79)),ROW(4:4)),4)),\"\",INDEX($A$1:$G$79,SMALL(IF($A$1:$A$79=$I$1,ROW($A$1:$A$79)),ROW(4:4)),4))","v":""},{"$f":"IF(ISERROR(INDEX($A$1:$G$79,SMALL(IF($A$1:$A$79=$I$1,ROW($A$1:$A$79)),ROW(4:4)),5)),\"\",INDEX($A$1:$G$79,SMALL(IF($A$1:$A$79=$I$1,ROW($A$1:$A$79)),ROW(4:4)),5))","v":""},{"$f":"IF(ISERROR(INDEX($A$1:$G$79,SMALL(IF($A$1:$A$79=$I$1,ROW($A$1:$A$79)),ROW(4:4)),6)),\"\",INDEX($A$1:$G$79,SMALL(IF($A$1:$A$79=$I$1,ROW($A$1:$A$79)),ROW(4:4)),6))","v":""},{"$f":"IF(ISERROR(INDEX($A$1:$H$79,SMALL(IF($A$1:$A$79=$I$1,ROW($A$1:$A$79)),ROW(4:4)),8)),\"\",INDEX($A$1:$H$79,SMALL(IF($A$1:$A$79=$I$1,ROW($A$1:$A$79)),ROW(4:4)),8))","v":""},{"$f":"IF(ISERROR(INDEX($A$1:$G$79,SMALL(IF($B$1:$B$79=$N$1,ROW($B$1:$B$79)),ROW(4:4)),6)),\"\",INDEX($A$1:$G$79,SMALL(IF($B$1:$B$79=$N$1,ROW($B$1:$B$79)),ROW(4:4)),6))","v":""},{"$f":"IF(ISERROR(INDEX($A$1:$G$79,SMALL(IF($B$1:$B$79=$N$1,ROW($B$1:$B$79)),ROW(4:4)),4)),\"\",INDEX($A$1:$G$79,SMALL(IF($B$1:$B$79=$N$1,ROW($B$1:$B$79)),ROW(4:4)),4))","v":""},{"$f":"IF(ISERROR(INDEX($A$1:$G$79,SMALL(IF($B$1:$B$79=$N$1,ROW($B$1:$B$79)),ROW(4:4)),5)),\"\",INDEX($A$1:$G$79,SMALL(IF($B$1:$B$79=$N$1,ROW($B$1:$B$79)),ROW(4:4)),5))","v":""},{"$f":"IF(ISERROR(INDEX($A$1:$G$79,SMALL(IF($B$1:$B$79=$N$1,ROW($B$1:$B$79)),ROW(4:4)),7)),\"\",INDEX($A$1:$G$79,SMALL(IF($B$1:$B$79=$N$1,ROW($B$1:$B$79)),ROW(4:4)),7))","v":""},{"$f":"IF(ISERROR(INDEX($A$1:$H$79,SMALL(IF($B$1:$B$79=$N$1,ROW($B$1:$B$79)),ROW(4:4)),8)),\"\",INDEX($A$1:$H$79,SMALL(IF($B$1:$B$79=$N$1,ROW($B$1:$B$79)),ROW(4:4)),8))","v":""},{"$f":"IF(ISERROR(INDEX($A$1:$G$79,SMALL(IF($C$1:$C$79=$S$1,ROW($C$1:$C$79)),ROW(4:4)),6)),\"\",INDEX($A$1:$G$79,SMALL(IF($C$1:$C$79=$S$1,ROW($C$1:$C$79)),ROW(4:4)),6))","v":""},{"$f":"IF(ISERROR(INDEX($A$1:$G$79,SMALL(IF($C$1:$C$79=$S$1,ROW($C$1:$C$79)),ROW(4:4)),4)),\"\",INDEX($A$1:$G$79,SMALL(IF($C$1:$C$79=$S$1,ROW($C$1:$C$79)),ROW(4:4)),4))","v":""},{"$f":"IF(ISERROR(INDEX($A$1:$G$79,SMALL(IF($C$1:$C$79=$S$1,ROW($C$1:$C$79)),ROW(4:4)),5)),\"\",INDEX($A$1:$G$79,SMALL(IF($C$1:$C$79=$S$1,ROW($C$1:$C$79)),ROW(4:4)),5))","v":""},{"$f":"IF(ISERROR(INDEX($A$1:$G$79,SMALL(IF($C$1:$C$79=$S$1,ROW($C$1:$C$79)),ROW(4:4)),7)),\"\",INDEX($A$1:$G$79,SMALL(IF($C$1:$C$79=$S$1,ROW($C$1:$C$79)),ROW(4:4)),7))","v":""},{"$f":"IF(ISERROR(INDEX($A$1:$H$79,SMALL(IF($C$1:$C$79=$S$1,ROW($C$1:$C$79)),ROW(4:4)),8)),\"\",INDEX($A$1:$H$79,SMALL(IF($C$1:$C$79=$S$1,ROW($C$1:$C$79)),ROW(4:4)),8))","v":""}," ","Non-evidenced (M-O)"]
[{"$f":"'Access & Input'!F11","v":"Please select answer"},{"$f":"'Access & Input'!G11","v":"Please select answer"},{"$f":"'Access & Input'!H11","v":"Please select answer"},{"$f":"'Access & Input'!B11","v":3},{"$f":"'Access & Input'!C11","v":"Access regardless of sexual orientation, gender identity, or marital status"},{"$f":"'Access & Input'!D11","v":"Equal access is provided in accordance with the 2012 and 2016 Equal Access Rules, meaning that any project funded by HUD must ensure equal access for persons regardless of one’s sexual orientation or marital status, and in accordance with one’s gender identity. Adult only households, regardless of marital status, should have equal access to projects (if these project types are not available within a CoC, the CoC should conduct an assessment to determine if these project types are needed and work with providers to accommodate the need). Please see Equal Access Rules here: https://www.hudexchange.info/resource/1991/equal-access-to-housing-final-rule/ "},"Access",{"$f":"F7","v":"Optional notes here"},{"$f":"IF(ISERROR(INDEX($A$1:$G$79,SMALL(IF($A$1:$A$79=$I$1,ROW($A$1:$A$79)),ROW(5:5)),7)),\"\",INDEX($A$1:$G$79,SMALL(IF($A$1:$A$79=$I$1,ROW($A$1:$A$79)),ROW(5:5)),7))","v":""},{"$f":"IF(ISERROR(INDEX($A$1:$G$79,SMALL(IF($A$1:$A$79=$I$1,ROW($A$1:$A$79)),ROW(5:5)),4)),\"\",INDEX($A$1:$G$79,SMALL(IF($A$1:$A$79=$I$1,ROW($A$1:$A$79)),ROW(5:5)),4))","v":""},{"$f":"IF(ISERROR(INDEX($A$1:$G$79,SMALL(IF($A$1:$A$79=$I$1,ROW($A$1:$A$79)),ROW(5:5)),5)),\"\",INDEX($A$1:$G$79,SMALL(IF($A$1:$A$79=$I$1,ROW($A$1:$A$79)),ROW(5:5)),5))","v":""},{"$f":"IF(ISERROR(INDEX($A$1:$G$79,SMALL(IF($A$1:$A$79=$I$1,ROW($A$1:$A$79)),ROW(5:5)),6)),\"\",INDEX($A$1:$G$79,SMALL(IF($A$1:$A$79=$I$1,ROW($A$1:$A$79)),ROW(5:5)),6))","v":""},{"$f":"IF(ISERROR(INDEX($A$1:$H$79,SMALL(IF($A$1:$A$79=$I$1,ROW($A$1:$A$79)),ROW(5:5)),8)),\"\",INDEX($A$1:$H$79,SMALL(IF($A$1:$A$79=$I$1,ROW($A$1:$A$79)),ROW(5:5)),8))","v":""},{"$f":"IF(ISERROR(INDEX($A$1:$G$79,SMALL(IF($B$1:$B$79=$N$1,ROW($B$1:$B$79)),ROW(5:5)),6)),\"\",INDEX($A$1:$G$79,SMALL(IF($B$1:$B$79=$N$1,ROW($B$1:$B$79)),ROW(5:5)),6))","v":""},{"$f":"IF(ISERROR(INDEX($A$1:$G$79,SMALL(IF($B$1:$B$79=$N$1,ROW($B$1:$B$79)),ROW(5:5)),4)),\"\",INDEX($A$1:$G$79,SMALL(IF($B$1:$B$79=$N$1,ROW($B$1:$B$79)),ROW(5:5)),4))","v":""},{"$f":"IF(ISERROR(INDEX($A$1:$G$79,SMALL(IF($B$1:$B$79=$N$1,ROW($B$1:$B$79)),ROW(5:5)),5)),\"\",INDEX($A$1:$G$79,SMALL(IF($B$1:$B$79=$N$1,ROW($B$1:$B$79)),ROW(5:5)),5))","v":""},{"$f":"IF(ISERROR(INDEX($A$1:$G$79,SMALL(IF($B$1:$B$79=$N$1,ROW($B$1:$B$79)),ROW(5:5)),7)),\"\",INDEX($A$1:$G$79,SMALL(IF($B$1:$B$79=$N$1,ROW($B$1:$B$79)),ROW(5:5)),7))","v":""},{"$f":"IF(ISERROR(INDEX($A$1:$H$79,SMALL(IF($B$1:$B$79=$N$1,ROW($B$1:$B$79)),ROW(5:5)),8)),\"\",INDEX($A$1:$H$79,SMALL(IF($B$1:$B$79=$N$1,ROW($B$1:$B$79)),ROW(5:5)),8))","v":""},{"$f":"IF(ISERROR(INDEX($A$1:$G$79,SMALL(IF($C$1:$C$79=$S$1,ROW($C$1:$C$79)),ROW(5:5)),6)),\"\",INDEX($A$1:$G$79,SMALL(IF($C$1:$C$79=$S$1,ROW($C$1:$C$79)),ROW(5:5)),6))","v":""},{"$f":"IF(ISERROR(INDEX($A$1:$G$79,SMALL(IF($C$1:$C$79=$S$1,ROW($C$1:$C$79)),ROW(5:5)),4)),\"\",INDEX($A$1:$G$79,SMALL(IF($C$1:$C$79=$S$1,ROW($C$1:$C$79)),ROW(5:5)),4))","v":""},{"$f":"IF(ISERROR(INDEX($A$1:$G$79,SMALL(IF($C$1:$C$79=$S$1,ROW($C$1:$C$79)),ROW(5:5)),5)),\"\",INDEX($A$1:$G$79,SMALL(IF($C$1:$C$79=$S$1,ROW($C$1:$C$79)),ROW(5:5)),5))","v":""},{"$f":"IF(ISERROR(INDEX($A$1:$G$79,SMALL(IF($C$1:$C$79=$S$1,ROW($C$1:$C$79)),ROW(5:5)),7)),\"\",INDEX($A$1:$G$79,SMALL(IF($C$1:$C$79=$S$1,ROW($C$1:$C$79)),ROW(5:5)),7))","v":""},{"$f":"IF(ISERROR(INDEX($A$1:$H$79,SMALL(IF($C$1:$C$79=$S$1,ROW($C$1:$C$79)),ROW(5:5)),8)),\"\",INDEX($A$1:$H$79,SMALL(IF($C$1:$C$79=$S$1,ROW($C$1:$C$79)),ROW(5:5)),8))","v":""}," "]
[{"$f":"'Access & Input'!F12","v":0},{"$f":"'Access & Input'!G12","v":0},{"$f":"'Access & Input'!H12","v":0},{"$f":"'Access & Input'!B12","v":0},{"$f":"'Access & Input'!C12","v":0},{"$f":"'Access & Input'!D12","v":"Optional notes here"},"Access",0,{"$f":"IF(ISERROR(INDEX($A$1:$G$79,SMALL(IF($A$1:$A$79=$I$1,ROW($A$1:$A$79)),ROW(6:6)),7)),\"\",INDEX($A$1:$G$79,SMALL(IF($A$1:$A$79=$I$1,ROW($A$1:$A$79)),ROW(6:6)),7))","v":""},{"$f":"IF(ISERROR(INDEX($A$1:$G$79,SMALL(IF($A$1:$A$79=$I$1,ROW($A$1:$A$79)),ROW(6:6)),4)),\"\",INDEX($A$1:$G$79,SMALL(IF($A$1:$A$79=$I$1,ROW($A$1:$A$79)),ROW(6:6)),4))","v":""},{"$f":"IF(ISERROR(INDEX($A$1:$G$79,SMALL(IF($A$1:$A$79=$I$1,ROW($A$1:$A$79)),ROW(6:6)),5)),\"\",INDEX($A$1:$G$79,SMALL(IF($A$1:$A$79=$I$1,ROW($A$1:$A$79)),ROW(6:6)),5))","v":""},{"$f":"IF(ISERROR(INDEX($A$1:$G$79,SMALL(IF($A$1:$A$79=$I$1,ROW($A$1:$A$79)),ROW(6:6)),6)),\"\",INDEX($A$1:$G$79,SMALL(IF($A$1:$A$79=$I$1,ROW($A$1:$A$79)),ROW(6:6)),6))","v":""},{"$f":"IF(ISERROR(INDEX($A$1:$H$79,SMALL(IF($A$1:$A$79=$I$1,ROW($A$1:$A$79)),ROW(6:6)),8)),\"\",INDEX($A$1:$H$79,SMALL(IF($A$1:$A$79=$I$1,ROW($A$1:$A$79)),ROW(6:6)),8))","v":""},{"$f":"IF(ISERROR(INDEX($A$1:$G$79,SMALL(IF($B$1:$B$79=$N$1,ROW($B$1:$B$79)),ROW(6:6)),6)),\"\",INDEX($A$1:$G$79,SMALL(IF($B$1:$B$79=$N$1,ROW($B$1:$B$79)),ROW(6:6)),6))","v":""},{"$f":"IF(ISERROR(INDEX($A$1:$G$79,SMALL(IF($B$1:$B$79=$N$1,ROW($B$1:$B$79)),ROW(6:6)),4)),\"\",INDEX($A$1:$G$79,SMALL(IF($B$1:$B$79=$N$1,ROW($B$1:$B$79)),ROW(6:6)),4))","v":""},{"$f":"IF(ISERROR(INDEX($A$1:$G$79,SMALL(IF($B$1:$B$79=$N$1,ROW($B$1:$B$79)),ROW(6:6)),5)),\"\",INDEX($A$1:$G$79,SMALL(IF($B$1:$B$79=$N$1,ROW($B$1:$B$79)),ROW(6:6)),5))","v":""},{"$f":"IF(ISERROR(INDEX($A$1:$G$79,SMALL(IF($B$1:$B$79=$N$1,ROW($B$1:$B$79)),ROW(6:6)),7)),\"\",INDEX($A$1:$G$79,SMALL(IF($B$1:$B$79=$N$1,ROW($B$1:$B$79)),ROW(6:6)),7))","v":""},{"$f":"IF(ISERROR(INDEX($A$1:$H$79,SMALL(IF($B$1:$B$79=$N$1,ROW($B$1:$B$79)),ROW(6:6)),8)),\"\",INDEX($A$1:$H$79,SMALL(IF($B$1:$B$79=$N$1,ROW($B$1:$B$79)),ROW(6:6)),8))","v":""},{"$f":"IF(ISERROR(INDEX($A$1:$G$79,SMALL(IF($C$1:$C$79=$S$1,ROW($C$1:$C$79)),ROW(6:6)),6)),\"\",INDEX($A$1:$G$79,SMALL(IF($C$1:$C$79=$S$1,ROW($C$1:$C$79)),ROW(6:6)),6))","v":""},{"$f":"IF(ISERROR(INDEX($A$1:$G$79,SMALL(IF($C$1:$C$79=$S$1,ROW($C$1:$C$79)),ROW(6:6)),4)),\"\",INDEX($A$1:$G$79,SMALL(IF($C$1:$C$79=$S$1,ROW($C$1:$C$79)),ROW(6:6)),4))","v":""},{"$f":"IF(ISERROR(INDEX($A$1:$G$79,SMALL(IF($C$1:$C$79=$S$1,ROW($C$1:$C$79)),ROW(6:6)),5)),\"\",INDEX($A$1:$G$79,SMALL(IF($C$1:$C$79=$S$1,ROW($C$1:$C$79)),ROW(6:6)),5))","v":""},{"$f":"IF(ISERROR(INDEX($A$1:$G$79,SMALL(IF($C$1:$C$79=$S$1,ROW($C$1:$C$79)),ROW(6:6)),7)),\"\",INDEX($A$1:$G$79,SMALL(IF($C$1:$C$79=$S$1,ROW($C$1:$C$79)),ROW(6:6)),7))","v":""},{"$f":"IF(ISERROR(INDEX($A$1:$H$79,SMALL(IF($C$1:$C$79=$S$1,ROW($C$1:$C$79)),ROW(6:6)),8)),\"\",INDEX($A$1:$H$79,SMALL(IF($C$1:$C$79=$S$1,ROW($C$1:$C$79)),ROW(6:6)),8))","v":""}," "]
[{"$f":"'Access & Input'!F13","v":"Please select answer"},{"$f":"'Access & Input'!G13","v":"Please select answer"},{"$f":"'Access & Input'!H13","v":"Please select answer"},{"$f":"'Access & Input'!B13","v":4},{"$f":"'Access & Input'!C13","v":"Admission process is expedited with speed and efficiency"},{"$f":"'Access & Input'!D13","v":"Projects have expedited admission processes, to the greatest extent possible, including helping participants obtain documentation required by funding sources, as well as processes to admit participants regardless of the status of their eligibility documentation whenever applicable."},"Access",{"$f":"F9","v":"Optional notes here"},{"$f":"IF(ISERROR(INDEX($A$1:$G$79,SMALL(IF($A$1:$A$79=$I$1,ROW($A$1:$A$79)),ROW(7:7)),7)),\"\",INDEX($A$1:$G$79,SMALL(IF($A$1:$A$79=$I$1,ROW($A$1:$A$79)),ROW(7:7)),7))","v":""},{"$f":"IF(ISERROR(INDEX($A$1:$G$79,SMALL(IF($A$1:$A$79=$I$1,ROW($A$1:$A$79)),ROW(7:7)),4)),\"\",INDEX($A$1:$G$79,SMALL(IF($A$1:$A$79=$I$1,ROW($A$1:$A$79)),ROW(7:7)),4))","v":""},{"$f":"IF(ISERROR(INDEX($A$1:$G$79,SMALL(IF($A$1:$A$79=$I$1,ROW($A$1:$A$79)),ROW(7:7)),5)),\"\",INDEX($A$1:$G$79,SMALL(IF($A$1:$A$79=$I$1,ROW($A$1:$A$79)),ROW(7:7)),5))","v":""},{"$f":"IF(ISERROR(INDEX($A$1:$G$79,SMALL(IF($A$1:$A$79=$I$1,ROW($A$1:$A$79)),ROW(7:7)),6)),\"\",INDEX($A$1:$G$79,SMALL(IF($A$1:$A$79=$I$1,ROW($A$1:$A$79)),ROW(7:7)),6))","v":""},{"$f":"IF(ISERROR(INDEX($A$1:$H$79,SMALL(IF($A$1:$A$79=$I$1,ROW($A$1:$A$79)),ROW(7:7)),8)),\"\",INDEX($A$1:$H$79,SMALL(IF($A$1:$A$79=$I$1,ROW($A$1:$A$79)),ROW(7:7)),8))","v":""},{"$f":"IF(ISERROR(INDEX($A$1:$G$79,SMALL(IF($B$1:$B$79=$N$1,ROW($B$1:$B$79)),ROW(7:7)),6)),\"\",INDEX($A$1:$G$79,SMALL(IF($B$1:$B$79=$N$1,ROW($B$1:$B$79)),ROW(7:7)),6))","v":""},{"$f":"IF(ISERROR(INDEX($A$1:$G$79,SMALL(IF($B$1:$B$79=$N$1,ROW($B$1:$B$79)),ROW(7:7)),4)),\"\",INDEX($A$1:$G$79,SMALL(IF($B$1:$B$79=$N$1,ROW($B$1:$B$79)),ROW(7:7)),4))","v":""},{"$f":"IF(ISERROR(INDEX($A$1:$G$79,SMALL(IF($B$1:$B$79=$N$1,ROW($B$1:$B$79)),ROW(7:7)),5)),\"\",INDEX($A$1:$G$79,SMALL(IF($B$1:$B$79=$N$1,ROW($B$1:$B$79)),ROW(7:7)),5))","v":""},{"$f":"IF(ISERROR(INDEX($A$1:$G$79,SMALL(IF($B$1:$B$79=$N$1,ROW($B$1:$B$79)),ROW(7:7)),7)),\"\",INDEX($A$1:$G$79,SMALL(IF($B$1:$B$79=$N$1,ROW($B$1:$B$79)),ROW(7:7)),7))","v":""},{"$f":"IF(ISERROR(INDEX($A$1:$H$79,SMALL(IF($B$1:$B$79=$N$1,ROW($B$1:$B$79)),ROW(7:7)),8)),\"\",INDEX($A$1:$H$79,SMALL(IF($B$1:$B$79=$N$1,ROW($B$1:$B$79)),ROW(7:7)),8))","v":""},{"$f":"IF(ISERROR(INDEX($A$1:$G$79,SMALL(IF($C$1:$C$79=$S$1,ROW($C$1:$C$79)),ROW(7:7)),6)),\"\",INDEX($A$1:$G$79,SMALL(IF($C$1:$C$79=$S$1,ROW($C$1:$C$79)),ROW(7:7)),6))","v":""},{"$f":"IF(ISERROR(INDEX($A$1:$G$79,SMALL(IF($C$1:$C$79=$S$1,ROW($C$1:$C$79)),ROW(7:7)),4)),\"\",INDEX($A$1:$G$79,SMALL(IF($C$1:$C$79=$S$1,ROW($C$1:$C$79)),ROW(7:7)),4))","v":""},{"$f":"IF(ISERROR(INDEX($A$1:$G$79,SMALL(IF($C$1:$C$79=$S$1,ROW($C$1:$C$79)),ROW(7:7)),5)),\"\",INDEX($A$1:$G$79,SMALL(IF($C$1:$C$79=$S$1,ROW($C$1:$C$79)),ROW(7:7)),5))","v":""},{"$f":"IF(ISERROR(INDEX($A$1:$G$79,SMALL(IF($C$1:$C$79=$S$1,ROW($C$1:$C$79)),ROW(7:7)),7)),\"\",INDEX($A$1:$G$79,SMALL(IF($C$1:$C$79=$S$1,ROW($C$1:$C$79)),ROW(7:7)),7))","v":""},{"$f":"IF(ISERROR(INDEX($A$1:$H$79,SMALL(IF($C$1:$C$79=$S$1,ROW($C$1:$C$79)),ROW(7:7)),8)),\"\",INDEX($A$1:$H$79,SMALL(IF($C$1:$C$79=$S$1,ROW($C$1:$C$79)),ROW(7:7)),8))","v":""}," "]
[{"$f":"'Access & Input'!F14","v":0},{"$f":"'Access & Input'!G14","v":0},{"$f":"'Access & Input'!H14","v":0},{"$f":"'Access & Input'!B14","v":0},{"$f":"'Access & Input'!C14","v":0},{"$f":"'Access & Input'!D14","v":"Optional notes here"},"Access",0,{"$f":"IF(ISERROR(INDEX($A$1:$G$79,SMALL(IF($A$1:$A$79=$I$1,ROW($A$1:$A$79)),ROW(8:8)),7)),\"\",INDEX($A$1:$G$79,SMALL(IF($A$1:$A$79=$I$1,ROW($A$1:$A$79)),ROW(8:8)),7))","v":""},{"$f":"IF(ISERROR(INDEX($A$1:$G$79,SMALL(IF($A$1:$A$79=$I$1,ROW($A$1:$A$79)),ROW(8:8)),4)),\"\",INDEX($A$1:$G$79,SMALL(IF($A$1:$A$79=$I$1,ROW($A$1:$A$79)),ROW(8:8)),4))","v":""},{"$f":"IF(ISERROR(INDEX($A$1:$G$79,SMALL(IF($A$1:$A$79=$I$1,ROW($A$1:$A$79)),ROW(8:8)),5)),\"\",INDEX($A$1:$G$79,SMALL(IF($A$1:$A$79=$I$1,ROW($A$1:$A$79)),ROW(8:8)),5))","v":""},{"$f":"IF(ISERROR(INDEX($A$1:$G$79,SMALL(IF($A$1:$A$79=$I$1,ROW($A$1:$A$79)),ROW(8:8)),6)),\"\",INDEX($A$1:$G$79,SMALL(IF($A$1:$A$79=$I$1,ROW($A$1:$A$79)),ROW(8:8)),6))","v":""},{"$f":"IF(ISERROR(INDEX($A$1:$H$79,SMALL(IF($A$1:$A$79=$I$1,ROW($A$1:$A$79)),ROW(8:8)),8)),\"\",INDEX($A$1:$H$79,SMALL(IF($A$1:$A$79=$I$1,ROW($A$1:$A$79)),ROW(8:8)),8))","v":""},{"$f":"IF(ISERROR(INDEX($A$1:$G$79,SMALL(IF($B$1:$B$79=$N$1,ROW($B$1:$B$79)),ROW(8:8)),6)),\"\",INDEX($A$1:$G$79,SMALL(IF($B$1:$B$79=$N$1,ROW($B$1:$B$79)),ROW(8:8)),6))","v":""},{"$f":"IF(ISERROR(INDEX($A$1:$G$79,SMALL(IF($B$1:$B$79=$N$1,ROW($B$1:$B$79)),ROW(8:8)),4)),\"\",INDEX($A$1:$G$79,SMALL(IF($B$1:$B$79=$N$1,ROW($B$1:$B$79)),ROW(8:8)),4))","v":""},{"$f":"IF(ISERROR(INDEX($A$1:$G$79,SMALL(IF($B$1:$B$79=$N$1,ROW($B$1:$B$79)),ROW(8:8)),5)),\"\",INDEX($A$1:$G$79,SMALL(IF($B$1:$B$79=$N$1,ROW($B$1:$B$79)),ROW(8:8)),5))","v":""},{"$f":"IF(ISERROR(INDEX($A$1:$G$79,SMALL(IF($B$1:$B$79=$N$1,ROW($B$1:$B$79)),ROW(8:8)),7)),\"\",INDEX($A$1:$G$79,SMALL(IF($B$1:$B$79=$N$1,ROW($B$1:$B$79)),ROW(8:8)),7))","v":""},{"$f":"IF(ISERROR(INDEX($A$1:$H$79,SMALL(IF($B$1:$B$79=$N$1,ROW($B$1:$B$79)),ROW(8:8)),8)),\"\",INDEX($A$1:$H$79,SMALL(IF($B$1:$B$79=$N$1,ROW($B$1:$B$79)),ROW(8:8)),8))","v":""},{"$f":"IF(ISERROR(INDEX($A$1:$G$79,SMALL(IF($C$1:$C$79=$S$1,ROW($C$1:$C$79)),ROW(8:8)),6)),\"\",INDEX($A$1:$G$79,SMALL(IF($C$1:$C$79=$S$1,ROW($C$1:$C$79)),ROW(8:8)),6))","v":""},{"$f":"IF(ISERROR(INDEX($A$1:$G$79,SMALL(IF($C$1:$C$79=$S$1,ROW($C$1:$C$79)),ROW(8:8)),4)),\"\",INDEX($A$1:$G$79,SMALL(IF($C$1:$C$79=$S$1,ROW($C$1:$C$79)),ROW(8:8)),4))","v":""},{"$f":"IF(ISERROR(INDEX($A$1:$G$79,SMALL(IF($C$1:$C$79=$S$1,ROW($C$1:$C$79)),ROW(8:8)),5)),\"\",INDEX($A$1:$G$79,SMALL(IF($C$1:$C$79=$S$1,ROW($C$1:$C$79)),ROW(8:8)),5))","v":""},{"$f":"IF(ISERROR(INDEX($A$1:$G$79,SMALL(IF($C$1:$C$79=$S$1,ROW($C$1:$C$79)),ROW(8:8)),7)),\"\",INDEX($A$1:$G$79,SMALL(IF($C$1:$C$79=$S$1,ROW($C$1:$C$79)),ROW(8:8)),7))","v":""},{"$f":"IF(ISERROR(INDEX($A$1:$H$79,SMALL(IF($C$1:$C$79=$S$1,ROW($C$1:$C$79)),ROW(8:8)),8)),\"\",INDEX($A$1:$H$79,SMALL(IF($C$1:$C$79=$S$1,ROW($C$1:$C$79)),ROW(8:8)),8))","v":""}," "]
[{"$f":"'Access & Input'!F15","v":"Please select answer"},{"$f":"'Access & Input'!G15","v":"Please select answer"},{"$f":"'Access & Input'!H15","v":"Please select answer"},{"$f":"'Access & Input'!B15","v":5},{"$f":"'Access & Input'!C15","v":" Intake processes are person-centered and flexible"},{"$f":"'Access & Input'!D15","v":"Intake and assessment procedures are focused on the individual’s or family’s strengths, needs, and preferences. Projects do not require specific appointment times, but have flexible intake schedules that ensure access to all households. Assessments are focused on identifying household strengths, resources, as well as identifying barriers to housing that can inform the basis of a housing plan as soon as a person is enrolled in the project. "},"Access",{"$f":"F11","v":"Optional notes here"},{"$f":"IF(ISERROR(INDEX($A$1:$G$79,SMALL(IF($A$1:$A$79=$I$1,ROW($A$1:$A$79)),ROW(9:9)),7)),\"\",INDEX($A$1:$G$79,SMALL(IF($A$1:$A$79=$I$1,ROW($A$1:$A$79)),ROW(9:9)),7))","v":""},{"$f":"IF(ISERROR(INDEX($A$1:$G$79,SMALL(IF($A$1:$A$79=$I$1,ROW($A$1:$A$79)),ROW(9:9)),4)),\"\",INDEX($A$1:$G$79,SMALL(IF($A$1:$A$79=$I$1,ROW($A$1:$A$79)),ROW(9:9)),4))","v":""},{"$f":"IF(ISERROR(INDEX($A$1:$G$79,SMALL(IF($A$1:$A$79=$I$1,ROW($A$1:$A$79)),ROW(9:9)),5)),\"\",INDEX($A$1:$G$79,SMALL(IF($A$1:$A$79=$I$1,ROW($A$1:$A$79)),ROW(9:9)),5))","v":""},{"$f":"IF(ISERROR(INDEX($A$1:$G$79,SMALL(IF($A$1:$A$79=$I$1,ROW($A$1:$A$79)),ROW(9:9)),6)),\"\",INDEX($A$1:$G$79,SMALL(IF($A$1:$A$79=$I$1,ROW($A$1:$A$79)),ROW(9:9)),6))","v":""},{"$f":"IF(ISERROR(INDEX($A$1:$H$79,SMALL(IF($A$1:$A$79=$I$1,ROW($A$1:$A$79)),ROW(9:9)),8)),\"\",INDEX($A$1:$H$79,SMALL(IF($A$1:$A$79=$I$1,ROW($A$1:$A$79)),ROW(9:9)),8))","v":""},{"$f":"IF(ISERROR(INDEX($A$1:$G$79,SMALL(IF($B$1:$B$79=$N$1,ROW($B$1:$B$79)),ROW(9:9)),6)),\"\",INDEX($A$1:$G$79,SMALL(IF($B$1:$B$79=$N$1,ROW($B$1:$B$79)),ROW(9:9)),6))","v":""},{"$f":"IF(ISERROR(INDEX($A$1:$G$79,SMALL(IF($B$1:$B$79=$N$1,ROW($B$1:$B$79)),ROW(9:9)),4)),\"\",INDEX($A$1:$G$79,SMALL(IF($B$1:$B$79=$N$1,ROW($B$1:$B$79)),ROW(9:9)),4))","v":""},{"$f":"IF(ISERROR(INDEX($A$1:$G$79,SMALL(IF($B$1:$B$79=$N$1,ROW($B$1:$B$79)),ROW(9:9)),5)),\"\",INDEX($A$1:$G$79,SMALL(IF($B$1:$B$79=$N$1,ROW($B$1:$B$79)),ROW(9:9)),5))","v":""},{"$f":"IF(ISERROR(INDEX($A$1:$G$79,SMALL(IF($B$1:$B$79=$N$1,ROW($B$1:$B$79)),ROW(9:9)),7)),\"\",INDEX($A$1:$G$79,SMALL(IF($B$1:$B$79=$N$1,ROW($B$1:$B$79)),ROW(9:9)),7))","v":""},{"$f":"IF(ISERROR(INDEX($A$1:$H$79,SMALL(IF($B$1:$B$79=$N$1,ROW($B$1:$B$79)),ROW(9:9)),8)),\"\",INDEX($A$1:$H$79,SMALL(IF($B$1:$B$79=$N$1,ROW($B$1:$B$79)),ROW(9:9)),8))","v":""},{"$f":"IF(ISERROR(INDEX($A$1:$G$79,SMALL(IF($C$1:$C$79=$S$1,ROW($C$1:$C$79)),ROW(9:9)),6)),\"\",INDEX($A$1:$G$79,SMALL(IF($C$1:$C$79=$S$1,ROW($C$1:$C$79)),ROW(9:9)),6))","v":""},{"$f":"IF(ISERROR(INDEX($A$1:$G$79,SMALL(IF($C$1:$C$79=$S$1,ROW($C$1:$C$79)),ROW(9:9)),4)),\"\",INDEX($A$1:$G$79,SMALL(IF($C$1:$C$79=$S$1,ROW($C$1:$C$79)),ROW(9:9)),4))","v":""},{"$f":"IF(ISERROR(INDEX($A$1:$G$79,SMALL(IF($C$1:$C$79=$S$1,ROW($C$1:$C$79)),ROW(9:9)),5)),\"\",INDEX($A$1:$G$79,SMALL(IF($C$1:$C$79=$S$1,ROW($C$1:$C$79)),ROW(9:9)),5))","v":""},{"$f":"IF(ISERROR(INDEX($A$1:$G$79,SMALL(IF($C$1:$C$79=$S$1,ROW($C$1:$C$79)),ROW(9:9)),7)),\"\",INDEX($A$1:$G$79,SMALL(IF($C$1:$C$79=$S$1,ROW($C$1:$C$79)),ROW(9:9)),7))","v":""},{"$f":"IF(ISERROR(INDEX($A$1:$H$79,SMALL(IF($C$1:$C$79=$S$1,ROW($C$1:$C$79)),ROW(9:9)),8)),\"\",INDEX($A$1:$H$79,SMALL(IF($C$1:$C$79=$S$1,ROW($C$1:$C$79)),ROW(9:9)),8))","v":""}," "]
[{"$f":"'Access & Input'!F16","v":0},{"$f":"'Access & Input'!G16","v":0},{"$f":"'Access & Input'!H16","v":0},{"$f":"'Access & Input'!B16","v":0},{"$f":"'Access & Input'!C16","v":0},{"$f":"'Access & Input'!D16","v":"Optional notes here"},"Access",0,{"$f":"IF(ISERROR(INDEX($A$1:$G$79,SMALL(IF($A$1:$A$79=$I$1,ROW($A$1:$A$79)),ROW(10:10)),7)),\"\",INDEX($A$1:$G$79,SMALL(IF($A$1:$A$79=$I$1,ROW($A$1:$A$79)),ROW(10:10)),7))","v":""},{"$f":"IF(ISERROR(INDEX($A$1:$G$79,SMALL(IF($A$1:$A$79=$I$1,ROW($A$1:$A$79)),ROW(10:10)),4)),\"\",INDEX($A$1:$G$79,SMALL(IF($A$1:$A$79=$I$1,ROW($A$1:$A$79)),ROW(10:10)),4))","v":""},{"$f":"IF(ISERROR(INDEX($A$1:$G$79,SMALL(IF($A$1:$A$79=$I$1,ROW($A$1:$A$79)),ROW(10:10)),5)),\"\",INDEX($A$1:$G$79,SMALL(IF($A$1:$A$79=$I$1,ROW($A$1:$A$79)),ROW(10:10)),5))","v":""},{"$f":"IF(ISERROR(INDEX($A$1:$G$79,SMALL(IF($A$1:$A$79=$I$1,ROW($A$1:$A$79)),ROW(10:10)),6)),\"\",INDEX($A$1:$G$79,SMALL(IF($A$1:$A$79=$I$1,ROW($A$1:$A$79)),ROW(10:10)),6))","v":""},{"$f":"IF(ISERROR(INDEX($A$1:$H$79,SMALL(IF($A$1:$A$79=$I$1,ROW($A$1:$A$79)),ROW(10:10)),8)),\"\",INDEX($A$1:$H$79,SMALL(IF($A$1:$A$79=$I$1,ROW($A$1:$A$79)),ROW(10:10)),8))","v":""},{"$f":"IF(ISERROR(INDEX($A$1:$G$79,SMALL(IF($B$1:$B$79=$N$1,ROW($B$1:$B$79)),ROW(10:10)),6)),\"\",INDEX($A$1:$G$79,SMALL(IF($B$1:$B$79=$N$1,ROW($B$1:$B$79)),ROW(10:10)),6))","v":""},{"$f":"IF(ISERROR(INDEX($A$1:$G$79,SMALL(IF($B$1:$B$79=$N$1,ROW($B$1:$B$79)),ROW(10:10)),4)),\"\",INDEX($A$1:$G$79,SMALL(IF($B$1:$B$79=$N$1,ROW($B$1:$B$79)),ROW(10:10)),4))","v":""},{"$f":"IF(ISERROR(INDEX($A$1:$G$79,SMALL(IF($B$1:$B$79=$N$1,ROW($B$1:$B$79)),ROW(10:10)),5)),\"\",INDEX($A$1:$G$79,SMALL(IF($B$1:$B$79=$N$1,ROW($B$1:$B$79)),ROW(10:10)),5))","v":""},{"$f":"IF(ISERROR(INDEX($A$1:$G$79,SMALL(IF($B$1:$B$79=$N$1,ROW($B$1:$B$79)),ROW(10:10)),7)),\"\",INDEX($A$1:$G$79,SMALL(IF($B$1:$B$79=$N$1,ROW($B$1:$B$79)),ROW(10:10)),7))","v":""},{"$f":"IF(ISERROR(INDEX($A$1:$H$79,SMALL(IF($B$1:$B$79=$N$1,ROW($B$1:$B$79)),ROW(10:10)),8)),\"\",INDEX($A$1:$H$79,SMALL(IF($B$1:$B$79=$N$1,ROW($B$1:$B$79)),ROW(10:10)),8))","v":""},{"$f":"IF(ISERROR(INDEX($A$1:$G$79,SMALL(IF($C$1:$C$79=$S$1,ROW($C$1:$C$79)),ROW(10:10)),6)),\"\",INDEX($A$1:$G$79,SMALL(IF($C$1:$C$79=$S$1,ROW($C$1:$C$79)),ROW(10:10)),6))","v":""},{"$f":"IF(ISERROR(INDEX($A$1:$G$79,SMALL(IF($C$1:$C$79=$S$1,ROW($C$1:$C$79)),ROW(10:10)),4)),\"\",INDEX($A$1:$G$79,SMALL(IF($C$1:$C$79=$S$1,ROW($C$1:$C$79)),ROW(10:10)),4))","v":""},{"$f":"IF(ISERROR(INDEX($A$1:$G$79,SMALL(IF($C$1:$C$79=$S$1,ROW($C$1:$C$79)),ROW(10:10)),5)),\"\",INDEX($A$1:$G$79,SMALL(IF($C$1:$C$79=$S$1,ROW($C$1:$C$79)),ROW(10:10)),5))","v":""},{"$f":"IF(ISERROR(INDEX($A$1:$G$79,SMALL(IF($C$1:$C$79=$S$1,ROW($C$1:$C$79)),ROW(10:10)),7)),\"\",INDEX($A$1:$G$79,SMALL(IF($C$1:$C$79=$S$1,ROW($C$1:$C$79)),ROW(10:10)),7))","v":""},{"$f":"IF(ISERROR(INDEX($A$1:$H$79,SMALL(IF($C$1:$C$79=$S$1,ROW($C$1:$C$79)),ROW(10:10)),8)),\"\",INDEX($A$1:$H$79,SMALL(IF($C$1:$C$79=$S$1,ROW($C$1:$C$79)),ROW(10:10)),8))","v":""}," "]
[{"$f":"'Access & Input'!F17","v":"Please select answer"},{"$f":"'Access & Input'!G17","v":"Please select answer"},{"$f":"'Access & Input'!H17","v":"Please select answer"},{"$f":"'Access & Input'!B17","v":6},{"$f":"'Access & Input'!C17","v":"The provider/project accepts and makes referrals directly through Coordinated Entry"},{"$f":"'Access & Input'!D17","v":"Projects actively participate in the CoC-designated Coordinated Entry processes as part of streamlined community-wide system access and triage. If these processes are not yet implemented, projects follow communities’ existing referral processes. Referrals from Coordinated Entry are rarely rejected, and only if there is a history of violence, the participant does not want to be in the project, there are legally valid grounds (such as restrictions regarding sex offenders)  or some other exceptional circumstance that is well documented."},"Access",{"$f":"F13","v":"Optional notes here"},{"$f":"IF(ISERROR(INDEX($A$1:$G$79,SMALL(IF($A$1:$A$79=$I$1,ROW($A$1:$A$79)),ROW(11:11)),7)),\"\",INDEX($A$1:$G$79,SMALL(IF($A$1:$A$79=$I$1,ROW($A$1:$A$79)),ROW(11:11)),7))","v":""},{"$f":"IF(ISERROR(INDEX($A$1:$G$79,SMALL(IF($A$1:$A$79=$I$1,ROW($A$1:$A$79)),ROW(11:11)),4)),\"\",INDEX($A$1:$G$79,SMALL(IF($A$1:$A$79=$I$1,ROW($A$1:$A$79)),ROW(11:11)),4))","v":""},{"$f":"IF(ISERROR(INDEX($A$1:$G$79,SMALL(IF($A$1:$A$79=$I$1,ROW($A$1:$A$79)),ROW(11:11)),5)),\"\",INDEX($A$1:$G$79,SMALL(IF($A$1:$A$79=$I$1,ROW($A$1:$A$79)),ROW(11:11)),5))","v":""},{"$f":"IF(ISERROR(INDEX($A$1:$G$79,SMALL(IF($A$1:$A$79=$I$1,ROW($A$1:$A$79)),ROW(11:11)),6)),\"\",INDEX($A$1:$G$79,SMALL(IF($A$1:$A$79=$I$1,ROW($A$1:$A$79)),ROW(11:11)),6))","v":""},{"$f":"IF(ISERROR(INDEX($A$1:$H$79,SMALL(IF($A$1:$A$79=$I$1,ROW($A$1:$A$79)),ROW(11:11)),8)),\"\",INDEX($A$1:$H$79,SMALL(IF($A$1:$A$79=$I$1,ROW($A$1:$A$79)),ROW(11:11)),8))","v":""},{"$f":"IF(ISERROR(INDEX($A$1:$G$79,SMALL(IF($B$1:$B$79=$N$1,ROW($B$1:$B$79)),ROW(11:11)),6)),\"\",INDEX($A$1:$G$79,SMALL(IF($B$1:$B$79=$N$1,ROW($B$1:$B$79)),ROW(11:11)),6))","v":""},{"$f":"IF(ISERROR(INDEX($A$1:$G$79,SMALL(IF($B$1:$B$79=$N$1,ROW($B$1:$B$79)),ROW(11:11)),4)),\"\",INDEX($A$1:$G$79,SMALL(IF($B$1:$B$79=$N$1,ROW($B$1:$B$79)),ROW(11:11)),4))","v":""},{"$f":"IF(ISERROR(INDEX($A$1:$G$79,SMALL(IF($B$1:$B$79=$N$1,ROW($B$1:$B$79)),ROW(11:11)),5)),\"\",INDEX($A$1:$G$79,SMALL(IF($B$1:$B$79=$N$1,ROW($B$1:$B$79)),ROW(11:11)),5))","v":""},{"$f":"IF(ISERROR(INDEX($A$1:$G$79,SMALL(IF($B$1:$B$79=$N$1,ROW($B$1:$B$79)),ROW(11:11)),7)),\"\",INDEX($A$1:$G$79,SMALL(IF($B$1:$B$79=$N$1,ROW($B$1:$B$79)),ROW(11:11)),7))","v":""},{"$f":"IF(ISERROR(INDEX($A$1:$H$79,SMALL(IF($B$1:$B$79=$N$1,ROW($B$1:$B$79)),ROW(11:11)),8)),\"\",INDEX($A$1:$H$79,SMALL(IF($B$1:$B$79=$N$1,ROW($B$1:$B$79)),ROW(11:11)),8))","v":""},{"$f":"IF(ISERROR(INDEX($A$1:$G$79,SMALL(IF($C$1:$C$79=$S$1,ROW($C$1:$C$79)),ROW(11:11)),6)),\"\",INDEX($A$1:$G$79,SMALL(IF($C$1:$C$79=$S$1,ROW($C$1:$C$79)),ROW(11:11)),6))","v":""},{"$f":"IF(ISERROR(INDEX($A$1:$G$79,SMALL(IF($C$1:$C$79=$S$1,ROW($C$1:$C$79)),ROW(11:11)),4)),\"\",INDEX($A$1:$G$79,SMALL(IF($C$1:$C$79=$S$1,ROW($C$1:$C$79)),ROW(11:11)),4))","v":""},{"$f":"IF(ISERROR(INDEX($A$1:$G$79,SMALL(IF($C$1:$C$79=$S$1,ROW($C$1:$C$79)),ROW(11:11)),5)),\"\",INDEX($A$1:$G$79,SMALL(IF($C$1:$C$79=$S$1,ROW($C$1:$C$79)),ROW(11:11)),5))","v":""},{"$f":"IF(ISERROR(INDEX($A$1:$G$79,SMALL(IF($C$1:$C$79=$S$1,ROW($C$1:$C$79)),ROW(11:11)),7)),\"\",INDEX($A$1:$G$79,SMALL(IF($C$1:$C$79=$S$1,ROW($C$1:$C$79)),ROW(11:11)),7))","v":""},{"$f":"IF(ISERROR(INDEX($A$1:$H$79,SMALL(IF($C$1:$C$79=$S$1,ROW($C$1:$C$79)),ROW(11:11)),8)),\"\",INDEX($A$1:$H$79,SMALL(IF($C$1:$C$79=$S$1,ROW($C$1:$C$79)),ROW(11:11)),8))","v":""}," "]
[{"$f":"'Access & Input'!F18","v":0},{"$f":"'Access & Input'!G18","v":0},{"$f":"'Access & Input'!H18","v":0},{"$f":"'Access & Input'!B18","v":0},{"$f":"'Access & Input'!C18","v":0},{"$f":"'Access & Input'!D18","v":"Optional notes here"},"Access",0,{"$f":"IF(ISERROR(INDEX($A$1:$G$79,SMALL(IF($A$1:$A$79=$I$1,ROW($A$1:$A$79)),ROW(12:12)),7)),\"\",INDEX($A$1:$G$79,SMALL(IF($A$1:$A$79=$I$1,ROW($A$1:$A$79)),ROW(12:12)),7))","v":""},{"$f":"IF(ISERROR(INDEX($A$1:$G$79,SMALL(IF($A$1:$A$79=$I$1,ROW($A$1:$A$79)),ROW(12:12)),4)),\"\",INDEX($A$1:$G$79,SMALL(IF($A$1:$A$79=$I$1,ROW($A$1:$A$79)),ROW(12:12)),4))","v":""},{"$f":"IF(ISERROR(INDEX($A$1:$G$79,SMALL(IF($A$1:$A$79=$I$1,ROW($A$1:$A$79)),ROW(12:12)),5)),\"\",INDEX($A$1:$G$79,SMALL(IF($A$1:$A$79=$I$1,ROW($A$1:$A$79)),ROW(12:12)),5))","v":""},{"$f":"IF(ISERROR(INDEX($A$1:$G$79,SMALL(IF($A$1:$A$79=$I$1,ROW($A$1:$A$79)),ROW(12:12)),6)),\"\",INDEX($A$1:$G$79,SMALL(IF($A$1:$A$79=$I$1,ROW($A$1:$A$79)),ROW(12:12)),6))","v":""},{"$f":"IF(ISERROR(INDEX($A$1:$H$79,SMALL(IF($A$1:$A$79=$I$1,ROW($A$1:$A$79)),ROW(12:12)),8)),\"\",INDEX($A$1:$H$79,SMALL(IF($A$1:$A$79=$I$1,ROW($A$1:$A$79)),ROW(12:12)),8))","v":""},{"$f":"IF(ISERROR(INDEX($A$1:$G$79,SMALL(IF($B$1:$B$79=$N$1,ROW($B$1:$B$79)),ROW(12:12)),6)),\"\",INDEX($A$1:$G$79,SMALL(IF($B$1:$B$79=$N$1,ROW($B$1:$B$79)),ROW(12:12)),6))","v":""},{"$f":"IF(ISERROR(INDEX($A$1:$G$79,SMALL(IF($B$1:$B$79=$N$1,ROW($B$1:$B$79)),ROW(12:12)),4)),\"\",INDEX($A$1:$G$79,SMALL(IF($B$1:$B$79=$N$1,ROW($B$1:$B$79)),ROW(12:12)),4))","v":""},{"$f":"IF(ISERROR(INDEX($A$1:$G$79,SMALL(IF($B$1:$B$79=$N$1,ROW($B$1:$B$79)),ROW(12:12)),5)),\"\",INDEX($A$1:$G$79,SMALL(IF($B$1:$B$79=$N$1,ROW($B$1:$B$79)),ROW(12:12)),5))","v":""},{"$f":"IF(ISERROR(INDEX($A$1:$G$79,SMALL(IF($B$1:$B$79=$N$1,ROW($B$1:$B$79)),ROW(12:12)),7)),\"\",INDEX($A$1:$G$79,SMALL(IF($B$1:$B$79=$N$1,ROW($B$1:$B$79)),ROW(12:12)),7))","v":""},{"$f":"IF(ISERROR(INDEX($A$1:$H$79,SMALL(IF($B$1:$B$79=$N$1,ROW($B$1:$B$79)),ROW(12:12)),8)),\"\",INDEX($A$1:$H$79,SMALL(IF($B$1:$B$79=$N$1,ROW($B$1:$B$79)),ROW(12:12)),8))","v":""},{"$f":"IF(ISERROR(INDEX($A$1:$G$79,SMALL(IF($C$1:$C$79=$S$1,ROW($C$1:$C$79)),ROW(12:12)),6)),\"\",INDEX($A$1:$G$79,SMALL(IF($C$1:$C$79=$S$1,ROW($C$1:$C$79)),ROW(12:12)),6))","v":""},{"$f":"IF(ISERROR(INDEX($A$1:$G$79,SMALL(IF($C$1:$C$79=$S$1,ROW($C$1:$C$79)),ROW(12:12)),4)),\"\",INDEX($A$1:$G$79,SMALL(IF($C$1:$C$79=$S$1,ROW($C$1:$C$79)),ROW(12:12)),4))","v":""},{"$f":"IF(ISERROR(INDEX($A$1:$G$79,SMALL(IF($C$1:$C$79=$S$1,ROW($C$1:$C$79)),ROW(12:12)),5)),\"\",INDEX($A$1:$G$79,SMALL(IF($C$1:$C$79=$S$1,ROW($C$1:$C$79)),ROW(12:12)),5))","v":""},{"$f":"IF(ISERROR(INDEX($A$1:$G$79,SMALL(IF($C$1:$C$79=$S$1,ROW($C$1:$C$79)),ROW(12:12)),7)),\"\",INDEX($A$1:$G$79,SMALL(IF($C$1:$C$79=$S$1,ROW($C$1:$C$79)),ROW(12:12)),7))","v":""},{"$f":"IF(ISERROR(INDEX($A$1:$H$79,SMALL(IF($C$1:$C$79=$S$1,ROW($C$1:$C$79)),ROW(12:12)),8)),\"\",INDEX($A$1:$H$79,SMALL(IF($C$1:$C$79=$S$1,ROW($C$1:$C$79)),ROW(12:12)),8))","v":""}," "]
[{"$f":"'Access & Input'!F19","v":"Please select answer"},{"$f":"'Access & Input'!G19","v":"Please select answer"},{"$f":"'Access & Input'!H19","v":"Please select answer"},{"$f":"'Access & Input'!B19","v":7},{"$f":"'Access & Input'!C19","v":"Exits to homelessness are avoided"},{"$f":"'Access & Input'!D19","v":"Projects that can no longer serve particular households utilize the coordinated entry process, or the communities’ existing referral processes if coordinated entry processes are not yet implemented, to ensure that those individuals and families have access to other housing and services as desired, and do not become disconnected from services and housing. Households encounter these exits under certain circumstances, such as if they demonstrate violent or harassing behaviors, which are described within agencies’ regulation-adherent policies."},"Access",{"$f":"F15","v":"Optional notes here"},{"$f":"IF(ISERROR(INDEX($A$1:$G$79,SMALL(IF($A$1:$A$79=$I$1,ROW($A$1:$A$79)),ROW(13:13)),7)),\"\",INDEX($A$1:$G$79,SMALL(IF($A$1:$A$79=$I$1,ROW($A$1:$A$79)),ROW(13:13)),7))","v":""},{"$f":"IF(ISERROR(INDEX($A$1:$G$79,SMALL(IF($A$1:$A$79=$I$1,ROW($A$1:$A$79)),ROW(13:13)),4)),\"\",INDEX($A$1:$G$79,SMALL(IF($A$1:$A$79=$I$1,ROW($A$1:$A$79)),ROW(13:13)),4))","v":""},{"$f":"IF(ISERROR(INDEX($A$1:$G$79,SMALL(IF($A$1:$A$79=$I$1,ROW($A$1:$A$79)),ROW(13:13)),5)),\"\",INDEX($A$1:$G$79,SMALL(IF($A$1:$A$79=$I$1,ROW($A$1:$A$79)),ROW(13:13)),5))","v":""},{"$f":"IF(ISERROR(INDEX($A$1:$G$79,SMALL(IF($A$1:$A$79=$I$1,ROW($A$1:$A$79)),ROW(13:13)),6)),\"\",INDEX($A$1:$G$79,SMALL(IF($A$1:$A$79=$I$1,ROW($A$1:$A$79)),ROW(13:13)),6))","v":""},{"$f":"IF(ISERROR(INDEX($A$1:$H$79,SMALL(IF($A$1:$A$79=$I$1,ROW($A$1:$A$79)),ROW(13:13)),8)),\"\",INDEX($A$1:$H$79,SMALL(IF($A$1:$A$79=$I$1,ROW($A$1:$A$79)),ROW(13:13)),8))","v":""},{"$f":"IF(ISERROR(INDEX($A$1:$G$79,SMALL(IF($B$1:$B$79=$N$1,ROW($B$1:$B$79)),ROW(13:13)),6)),\"\",INDEX($A$1:$G$79,SMALL(IF($B$1:$B$79=$N$1,ROW($B$1:$B$79)),ROW(13:13)),6))","v":""},{"$f":"IF(ISERROR(INDEX($A$1:$G$79,SMALL(IF($B$1:$B$79=$N$1,ROW($B$1:$B$79)),ROW(13:13)),4)),\"\",INDEX($A$1:$G$79,SMALL(IF($B$1:$B$79=$N$1,ROW($B$1:$B$79)),ROW(13:13)),4))","v":""},{"$f":"IF(ISERROR(INDEX($A$1:$G$79,SMALL(IF($B$1:$B$79=$N$1,ROW($B$1:$B$79)),ROW(13:13)),5)),\"\",INDEX($A$1:$G$79,SMALL(IF($B$1:$B$79=$N$1,ROW($B$1:$B$79)),ROW(13:13)),5))","v":""},{"$f":"IF(ISERROR(INDEX($A$1:$G$79,SMALL(IF($B$1:$B$79=$N$1,ROW($B$1:$B$79)),ROW(13:13)),7)),\"\",INDEX($A$1:$G$79,SMALL(IF($B$1:$B$79=$N$1,ROW($B$1:$B$79)),ROW(13:13)),7))","v":""},{"$f":"IF(ISERROR(INDEX($A$1:$H$79,SMALL(IF($B$1:$B$79=$N$1,ROW($B$1:$B$79)),ROW(13:13)),8)),\"\",INDEX($A$1:$H$79,SMALL(IF($B$1:$B$79=$N$1,ROW($B$1:$B$79)),ROW(13:13)),8))","v":""},{"$f":"IF(ISERROR(INDEX($A$1:$G$79,SMALL(IF($C$1:$C$79=$S$1,ROW($C$1:$C$79)),ROW(13:13)),6)),\"\",INDEX($A$1:$G$79,SMALL(IF($C$1:$C$79=$S$1,ROW($C$1:$C$79)),ROW(13:13)),6))","v":""},{"$f":"IF(ISERROR(INDEX($A$1:$G$79,SMALL(IF($C$1:$C$79=$S$1,ROW($C$1:$C$79)),ROW(13:13)),4)),\"\",INDEX($A$1:$G$79,SMALL(IF($C$1:$C$79=$S$1,ROW($C$1:$C$79)),ROW(13:13)),4))","v":""},{"$f":"IF(ISERROR(INDEX($A$1:$G$79,SMALL(IF($C$1:$C$79=$S$1,ROW($C$1:$C$79)),ROW(13:13)),5)),\"\",INDEX($A$1:$G$79,SMALL(IF($C$1:$C$79=$S$1,ROW($C$1:$C$79)),ROW(13:13)),5))","v":""},{"$f":"IF(ISERROR(INDEX($A$1:$G$79,SMALL(IF($C$1:$C$79=$S$1,ROW($C$1:$C$79)),ROW(13:13)),7)),\"\",INDEX($A$1:$G$79,SMALL(IF($C$1:$C$79=$S$1,ROW($C$1:$C$79)),ROW(13:13)),7))","v":""},{"$f":"IF(ISERROR(INDEX($A$1:$H$79,SMALL(IF($C$1:$C$79=$S$1,ROW($C$1:$C$79)),ROW(13:13)),8)),\"\",INDEX($A$1:$H$79,SMALL(IF($C$1:$C$79=$S$1,ROW($C$1:$C$79)),ROW(13:13)),8))","v":""}," "]
[{"$f":"'Access & Input'!F20","v":0},{"$f":"'Access & Input'!G20","v":0},{"$f":"'Access & Input'!H20","v":0},{"$f":"'Access & Input'!B20","v":0},{"$f":"'Access & Input'!C20","v":0},{"$f":"'Access & Input'!D20","v":"Optional notes here"},"Access",0,{"$f":"IF(ISERROR(INDEX($A$1:$G$79,SMALL(IF($A$1:$A$79=$I$1,ROW($A$1:$A$79)),ROW(14:14)),7)),\"\",INDEX($A$1:$G$79,SMALL(IF($A$1:$A$79=$I$1,ROW($A$1:$A$79)),ROW(14:14)),7))","v":""},{"$f":"IF(ISERROR(INDEX($A$1:$G$79,SMALL(IF($A$1:$A$79=$I$1,ROW($A$1:$A$79)),ROW(14:14)),4)),\"\",INDEX($A$1:$G$79,SMALL(IF($A$1:$A$79=$I$1,ROW($A$1:$A$79)),ROW(14:14)),4))","v":""},{"$f":"IF(ISERROR(INDEX($A$1:$G$79,SMALL(IF($A$1:$A$79=$I$1,ROW($A$1:$A$79)),ROW(14:14)),5)),\"\",INDEX($A$1:$G$79,SMALL(IF($A$1:$A$79=$I$1,ROW($A$1:$A$79)),ROW(14:14)),5))","v":""},{"$f":"IF(ISERROR(INDEX($A$1:$G$79,SMALL(IF($A$1:$A$79=$I$1,ROW($A$1:$A$79)),ROW(14:14)),6)),\"\",INDEX($A$1:$G$79,SMALL(IF($A$1:$A$79=$I$1,ROW($A$1:$A$79)),ROW(14:14)),6))","v":""},{"$f":"IF(ISERROR(INDEX($A$1:$H$79,SMALL(IF($A$1:$A$79=$I$1,ROW($A$1:$A$79)),ROW(14:14)),8)),\"\",INDEX($A$1:$H$79,SMALL(IF($A$1:$A$79=$I$1,ROW($A$1:$A$79)),ROW(14:14)),8))","v":""},{"$f":"IF(ISERROR(INDEX($A$1:$G$79,SMALL(IF($B$1:$B$79=$N$1,ROW($B$1:$B$79)),ROW(14:14)),6)),\"\",INDEX($A$1:$G$79,SMALL(IF($B$1:$B$79=$N$1,ROW($B$1:$B$79)),ROW(14:14)),6))","v":""},{"$f":"IF(ISERROR(INDEX($A$1:$G$79,SMALL(IF($B$1:$B$79=$N$1,ROW($B$1:$B$79)),ROW(14:14)),4)),\"\",INDEX($A$1:$G$79,SMALL(IF($B$1:$B$79=$N$1,ROW($B$1:$B$79)),ROW(14:14)),4))","v":""},{"$f":"IF(ISERROR(INDEX($A$1:$G$79,SMALL(IF($B$1:$B$79=$N$1,ROW($B$1:$B$79)),ROW(14:14)),5)),\"\",INDEX($A$1:$G$79,SMALL(IF($B$1:$B$79=$N$1,ROW($B$1:$B$79)),ROW(14:14)),5))","v":""},{"$f":"IF(ISERROR(INDEX($A$1:$G$79,SMALL(IF($B$1:$B$79=$N$1,ROW($B$1:$B$79)),ROW(14:14)),7)),\"\",INDEX($A$1:$G$79,SMALL(IF($B$1:$B$79=$N$1,ROW($B$1:$B$79)),ROW(14:14)),7))","v":""},{"$f":"IF(ISERROR(INDEX($A$1:$H$79,SMALL(IF($B$1:$B$79=$N$1,ROW($B$1:$B$79)),ROW(14:14)),8)),\"\",INDEX($A$1:$H$79,SMALL(IF($B$1:$B$79=$N$1,ROW($B$1:$B$79)),ROW(14:14)),8))","v":""},{"$f":"IF(ISERROR(INDEX($A$1:$G$79,SMALL(IF($C$1:$C$79=$S$1,ROW($C$1:$C$79)),ROW(14:14)),6)),\"\",INDEX($A$1:$G$79,SMALL(IF($C$1:$C$79=$S$1,ROW($C$1:$C$79)),ROW(14:14)),6))","v":""},{"$f":"IF(ISERROR(INDEX($A$1:$G$79,SMALL(IF($C$1:$C$79=$S$1,ROW($C$1:$C$79)),ROW(14:14)),4)),\"\",INDEX($A$1:$G$79,SMALL(IF($C$1:$C$79=$S$1,ROW($C$1:$C$79)),ROW(14:14)),4))","v":""},{"$f":"IF(ISERROR(INDEX($A$1:$G$79,SMALL(IF($C$1:$C$79=$S$1,ROW($C$1:$C$79)),ROW(14:14)),5)),\"\",INDEX($A$1:$G$79,SMALL(IF($C$1:$C$79=$S$1,ROW($C$1:$C$79)),ROW(14:14)),5))","v":""},{"$f":"IF(ISERROR(INDEX($A$1:$G$79,SMALL(IF($C$1:$C$79=$S$1,ROW($C$1:$C$79)),ROW(14:14)),7)),\"\",INDEX($A$1:$G$79,SMALL(IF($C$1:$C$79=$S$1,ROW($C$1:$C$79)),ROW(14:14)),7))","v":""},{"$f":"IF(ISERROR(INDEX($A$1:$H$79,SMALL(IF($C$1:$C$79=$S$1,ROW($C$1:$C$79)),ROW(14:14)),8)),\"\",INDEX($A$1:$H$79,SMALL(IF($C$1:$C$79=$S$1,ROW($C$1:$C$79)),ROW(14:14)),8))","v":""}," "]
[{"$f":"'Access & Input'!F22","v":"Please select answer"},{"$f":"'Access & Input'!G22","v":"Please select answer"},{"$f":"'Access & Input'!H22","v":"Please select answer"},{"$f":"'Access & Input'!B22","v":1},{"$f":"'Access & Input'!C22","v":"Participant education is ongoing"},{"$f":"'Access & Input'!D22","v":"Project participants receive ongoing education on Housing First principles as well as other service models employed in the project. In the beginning of and throughout tenancy, participants are informed about their full rights and responsibilities as lease holders, including the potential causes for eviction. "},"Participant Input",{"$f":"F17","v":"Optional notes here"},{"$f":"IF(ISERROR(INDEX($A$1:$G$79,SMALL(IF($A$1:$A$79=$I$1,ROW($A$1:$A$79)),ROW(15:15)),7)),\"\",INDEX($A$1:$G$79,SMALL(IF($A$1:$A$79=$I$1,ROW($A$1:$A$79)),ROW(15:15)),7))","v":""},{"$f":"IF(ISERROR(INDEX($A$1:$G$79,SMALL(IF($A$1:$A$79=$I$1,ROW($A$1:$A$79)),ROW(15:15)),4)),\"\",INDEX($A$1:$G$79,SMALL(IF($A$1:$A$79=$I$1,ROW($A$1:$A$79)),ROW(15:15)),4))","v":""},{"$f":"IF(ISERROR(INDEX($A$1:$G$79,SMALL(IF($A$1:$A$79=$I$1,ROW($A$1:$A$79)),ROW(15:15)),5)),\"\",INDEX($A$1:$G$79,SMALL(IF($A$1:$A$79=$I$1,ROW($A$1:$A$79)),ROW(15:15)),5))","v":""},{"$f":"IF(ISERROR(INDEX($A$1:$G$79,SMALL(IF($A$1:$A$79=$I$1,ROW($A$1:$A$79)),ROW(15:15)),6)),\"\",INDEX($A$1:$G$79,SMALL(IF($A$1:$A$79=$I$1,ROW($A$1:$A$79)),ROW(15:15)),6))","v":""},{"$f":"IF(ISERROR(INDEX($A$1:$H$79,SMALL(IF($A$1:$A$79=$I$1,ROW($A$1:$A$79)),ROW(15:15)),8)),\"\",INDEX($A$1:$H$79,SMALL(IF($A$1:$A$79=$I$1,ROW($A$1:$A$79)),ROW(15:15)),8))","v":""},{"$f":"IF(ISERROR(INDEX($A$1:$G$79,SMALL(IF($B$1:$B$79=$N$1,ROW($B$1:$B$79)),ROW(15:15)),6)),\"\",INDEX($A$1:$G$79,SMALL(IF($B$1:$B$79=$N$1,ROW($B$1:$B$79)),ROW(15:15)),6))","v":""},{"$f":"IF(ISERROR(INDEX($A$1:$G$79,SMALL(IF($B$1:$B$79=$N$1,ROW($B$1:$B$79)),ROW(15:15)),4)),\"\",INDEX($A$1:$G$79,SMALL(IF($B$1:$B$79=$N$1,ROW($B$1:$B$79)),ROW(15:15)),4))","v":""},{"$f":"IF(ISERROR(INDEX($A$1:$G$79,SMALL(IF($B$1:$B$79=$N$1,ROW($B$1:$B$79)),ROW(15:15)),5)),\"\",INDEX($A$1:$G$79,SMALL(IF($B$1:$B$79=$N$1,ROW($B$1:$B$79)),ROW(15:15)),5))","v":""},{"$f":"IF(ISERROR(INDEX($A$1:$G$79,SMALL(IF($B$1:$B$79=$N$1,ROW($B$1:$B$79)),ROW(15:15)),7)),\"\",INDEX($A$1:$G$79,SMALL(IF($B$1:$B$79=$N$1,ROW($B$1:$B$79)),ROW(15:15)),7))","v":""},{"$f":"IF(ISERROR(INDEX($A$1:$H$79,SMALL(IF($B$1:$B$79=$N$1,ROW($B$1:$B$79)),ROW(15:15)),8)),\"\",INDEX($A$1:$H$79,SMALL(IF($B$1:$B$79=$N$1,ROW($B$1:$B$79)),ROW(15:15)),8))","v":""},{"$f":"IF(ISERROR(INDEX($A$1:$G$79,SMALL(IF($C$1:$C$79=$S$1,ROW($C$1:$C$79)),ROW(15:15)),6)),\"\",INDEX($A$1:$G$79,SMALL(IF($C$1:$C$79=$S$1,ROW($C$1:$C$79)),ROW(15:15)),6))","v":""},{"$f":"IF(ISERROR(INDEX($A$1:$G$79,SMALL(IF($C$1:$C$79=$S$1,ROW($C$1:$C$79)),ROW(15:15)),4)),\"\",INDEX($A$1:$G$79,SMALL(IF($C$1:$C$79=$S$1,ROW($C$1:$C$79)),ROW(15:15)),4))","v":""},{"$f":"IF(ISERROR(INDEX($A$1:$G$79,SMALL(IF($C$1:$C$79=$S$1,ROW($C$1:$C$79)),ROW(15:15)),5)),\"\",INDEX($A$1:$G$79,SMALL(IF($C$1:$C$79=$S$1,ROW($C$1:$C$79)),ROW(15:15)),5))","v":""},{"$f":"IF(ISERROR(INDEX($A$1:$G$79,SMALL(IF($C$1:$C$79=$S$1,ROW($C$1:$C$79)),ROW(15:15)),7)),\"\",INDEX($A$1:$G$79,SMALL(IF($C$1:$C$79=$S$1,ROW($C$1:$C$79)),ROW(15:15)),7))","v":""},{"$f":"IF(ISERROR(INDEX($A$1:$H$79,SMALL(IF($C$1:$C$79=$S$1,ROW($C$1:$C$79)),ROW(15:15)),8)),\"\",INDEX($A$1:$H$79,SMALL(IF($C$1:$C$79=$S$1,ROW($C$1:$C$79)),ROW(15:15)),8))","v":""}," "]
[{"$f":"'Access & Input'!F23","v":0},{"$f":"'Access & Input'!G23","v":0},{"$f":"'Access & Input'!H23","v":0},{"$f":"'Access & Input'!B23","v":0},{"$f":"'Access & Input'!C23","v":0},{"$f":"'Access & Input'!D23","v":"Optional notes here"},"Participant Input",0,{"$f":"IF(ISERROR(INDEX($A$1:$G$79,SMALL(IF($A$1:$A$79=$I$1,ROW($A$1:$A$79)),ROW(16:16)),7)),\"\",INDEX($A$1:$G$79,SMALL(IF($A$1:$A$79=$I$1,ROW($A$1:$A$79)),ROW(16:16)),7))","v":""},{"$f":"IF(ISERROR(INDEX($A$1:$G$79,SMALL(IF($A$1:$A$79=$I$1,ROW($A$1:$A$79)),ROW(16:16)),4)),\"\",INDEX($A$1:$G$79,SMALL(IF($A$1:$A$79=$I$1,ROW($A$1:$A$79)),ROW(16:16)),4))","v":""},{"$f":"IF(ISERROR(INDEX($A$1:$G$79,SMALL(IF($A$1:$A$79=$I$1,ROW($A$1:$A$79)),ROW(16:16)),5)),\"\",INDEX($A$1:$G$79,SMALL(IF($A$1:$A$79=$I$1,ROW($A$1:$A$79)),ROW(16:16)),5))","v":""},{"$f":"IF(ISERROR(INDEX($A$1:$G$79,SMALL(IF($A$1:$A$79=$I$1,ROW($A$1:$A$79)),ROW(16:16)),6)),\"\",INDEX($A$1:$G$79,SMALL(IF($A$1:$A$79=$I$1,ROW($A$1:$A$79)),ROW(16:16)),6))","v":""},{"$f":"IF(ISERROR(INDEX($A$1:$H$79,SMALL(IF($A$1:$A$79=$I$1,ROW($A$1:$A$79)),ROW(16:16)),8)),\"\",INDEX($A$1:$H$79,SMALL(IF($A$1:$A$79=$I$1,ROW($A$1:$A$79)),ROW(16:16)),8))","v":""},{"$f":"IF(ISERROR(INDEX($A$1:$G$79,SMALL(IF($B$1:$B$79=$N$1,ROW($B$1:$B$79)),ROW(16:16)),6)),\"\",INDEX($A$1:$G$79,SMALL(IF($B$1:$B$79=$N$1,ROW($B$1:$B$79)),ROW(16:16)),6))","v":""},{"$f":"IF(ISERROR(INDEX($A$1:$G$79,SMALL(IF($B$1:$B$79=$N$1,ROW($B$1:$B$79)),ROW(16:16)),4)),\"\",INDEX($A$1:$G$79,SMALL(IF($B$1:$B$79=$N$1,ROW($B$1:$B$79)),ROW(16:16)),4))","v":""},{"$f":"IF(ISERROR(INDEX($A$1:$G$79,SMALL(IF($B$1:$B$79=$N$1,ROW($B$1:$B$79)),ROW(16:16)),5)),\"\",INDEX($A$1:$G$79,SMALL(IF($B$1:$B$79=$N$1,ROW($B$1:$B$79)),ROW(16:16)),5))","v":""},{"$f":"IF(ISERROR(INDEX($A$1:$G$79,SMALL(IF($B$1:$B$79=$N$1,ROW($B$1:$B$79)),ROW(16:16)),7)),\"\",INDEX($A$1:$G$79,SMALL(IF($B$1:$B$79=$N$1,ROW($B$1:$B$79)),ROW(16:16)),7))","v":""},{"$f":"IF(ISERROR(INDEX($A$1:$H$79,SMALL(IF($B$1:$B$79=$N$1,ROW($B$1:$B$79)),ROW(16:16)),8)),\"\",INDEX($A$1:$H$79,SMALL(IF($B$1:$B$79=$N$1,ROW($B$1:$B$79)),ROW(16:16)),8))","v":""},{"$f":"IF(ISERROR(INDEX($A$1:$G$79,SMALL(IF($C$1:$C$79=$S$1,ROW($C$1:$C$79)),ROW(16:16)),6)),\"\",INDEX($A$1:$G$79,SMALL(IF($C$1:$C$79=$S$1,ROW($C$1:$C$79)),ROW(16:16)),6))","v":""},{"$f":"IF(ISERROR(INDEX($A$1:$G$79,SMALL(IF($C$1:$C$79=$S$1,ROW($C$1:$C$79)),ROW(16:16)),4)),\"\",INDEX($A$1:$G$79,SMALL(IF($C$1:$C$79=$S$1,ROW($C$1:$C$79)),ROW(16:16)),4))","v":""},{"$f":"IF(ISERROR(INDEX($A$1:$G$79,SMALL(IF($C$1:$C$79=$S$1,ROW($C$1:$C$79)),ROW(16:16)),5)),\"\",INDEX($A$1:$G$79,SMALL(IF($C$1:$C$79=$S$1,ROW($C$1:$C$79)),ROW(16:16)),5))","v":""},{"$f":"IF(ISERROR(INDEX($A$1:$G$79,SMALL(IF($C$1:$C$79=$S$1,ROW($C$1:$C$79)),ROW(16:16)),7)),\"\",INDEX($A$1:$G$79,SMALL(IF($C$1:$C$79=$S$1,ROW($C$1:$C$79)),ROW(16:16)),7))","v":""},{"$f":"IF(ISERROR(INDEX($A$1:$H$79,SMALL(IF($C$1:$C$79=$S$1,ROW($C$1:$C$79)),ROW(16:16)),8)),\"\",INDEX($A$1:$H$79,SMALL(IF($C$1:$C$79=$S$1,ROW($C$1:$C$79)),ROW(16:16)),8))","v":""}," "]
[{"$f":"'Access & Input'!F24","v":"Please select answer"},{"$f":"'Access & Input'!G24","v":"Please select answer"},{"$f":"'Access & Input'!H24","v":"Please select answer"},{"$f":"'Access & Input'!B24","v":2},{"$f":"'Access & Input'!C24","v":"Projects create regular, formal opportunities for participants to offer input"},{"$f":"'Access & Input'!D24","v":"Input is welcomed regarding the project’s policies, processes, procedures, and practices. Opportunities include involvement in: quality assurance and evaluation processes, a participant leadership/advisory board, processes to formally communicate with landlords, the design of and participation in surveys and focus groups, planning social gatherings, integrating peer specialists and peer-facilitated support groups to compliment professional services."},"Participant Input",{"$f":"F19","v":"Optional notes here"},{"$f":"IF(ISERROR(INDEX($A$1:$G$79,SMALL(IF($A$1:$A$79=$I$1,ROW($A$1:$A$79)),ROW(17:17)),7)),\"\",INDEX($A$1:$G$79,SMALL(IF($A$1:$A$79=$I$1,ROW($A$1:$A$79)),ROW(17:17)),7))","v":""},{"$f":"IF(ISERROR(INDEX($A$1:$G$79,SMALL(IF($A$1:$A$79=$I$1,ROW($A$1:$A$79)),ROW(17:17)),4)),\"\",INDEX($A$1:$G$79,SMALL(IF($A$1:$A$79=$I$1,ROW($A$1:$A$79)),ROW(17:17)),4))","v":""},{"$f":"IF(ISERROR(INDEX($A$1:$G$79,SMALL(IF($A$1:$A$79=$I$1,ROW($A$1:$A$79)),ROW(17:17)),5)),\"\",INDEX($A$1:$G$79,SMALL(IF($A$1:$A$79=$I$1,ROW($A$1:$A$79)),ROW(17:17)),5))","v":""},{"$f":"IF(ISERROR(INDEX($A$1:$G$79,SMALL(IF($A$1:$A$79=$I$1,ROW($A$1:$A$79)),ROW(17:17)),6)),\"\",INDEX($A$1:$G$79,SMALL(IF($A$1:$A$79=$I$1,ROW($A$1:$A$79)),ROW(17:17)),6))","v":""},{"$f":"IF(ISERROR(INDEX($A$1:$H$79,SMALL(IF($A$1:$A$79=$I$1,ROW($A$1:$A$79)),ROW(17:17)),8)),\"\",INDEX($A$1:$H$79,SMALL(IF($A$1:$A$79=$I$1,ROW($A$1:$A$79)),ROW(17:17)),8))","v":""},{"$f":"IF(ISERROR(INDEX($A$1:$G$79,SMALL(IF($B$1:$B$79=$N$1,ROW($B$1:$B$79)),ROW(17:17)),6)),\"\",INDEX($A$1:$G$79,SMALL(IF($B$1:$B$79=$N$1,ROW($B$1:$B$79)),ROW(17:17)),6))","v":""},{"$f":"IF(ISERROR(INDEX($A$1:$G$79,SMALL(IF($B$1:$B$79=$N$1,ROW($B$1:$B$79)),ROW(17:17)),4)),\"\",INDEX($A$1:$G$79,SMALL(IF($B$1:$B$79=$N$1,ROW($B$1:$B$79)),ROW(17:17)),4))","v":""},{"$f":"IF(ISERROR(INDEX($A$1:$G$79,SMALL(IF($B$1:$B$79=$N$1,ROW($B$1:$B$79)),ROW(17:17)),5)),\"\",INDEX($A$1:$G$79,SMALL(IF($B$1:$B$79=$N$1,ROW($B$1:$B$79)),ROW(17:17)),5))","v":""},{"$f":"IF(ISERROR(INDEX($A$1:$G$79,SMALL(IF($B$1:$B$79=$N$1,ROW($B$1:$B$79)),ROW(17:17)),7)),\"\",INDEX($A$1:$G$79,SMALL(IF($B$1:$B$79=$N$1,ROW($B$1:$B$79)),ROW(17:17)),7))","v":""},{"$f":"IF(ISERROR(INDEX($A$1:$H$79,SMALL(IF($B$1:$B$79=$N$1,ROW($B$1:$B$79)),ROW(17:17)),8)),\"\",INDEX($A$1:$H$79,SMALL(IF($B$1:$B$79=$N$1,ROW($B$1:$B$79)),ROW(17:17)),8))","v":""},{"$f":"IF(ISERROR(INDEX($A$1:$G$79,SMALL(IF($C$1:$C$79=$S$1,ROW($C$1:$C$79)),ROW(17:17)),6)),\"\",INDEX($A$1:$G$79,SMALL(IF($C$1:$C$79=$S$1,ROW($C$1:$C$79)),ROW(17:17)),6))","v":""},{"$f":"IF(ISERROR(INDEX($A$1:$G$79,SMALL(IF($C$1:$C$79=$S$1,ROW($C$1:$C$79)),ROW(17:17)),4)),\"\",INDEX($A$1:$G$79,SMALL(IF($C$1:$C$79=$S$1,ROW($C$1:$C$79)),ROW(17:17)),4))","v":""},{"$f":"IF(ISERROR(INDEX($A$1:$G$79,SMALL(IF($C$1:$C$79=$S$1,ROW($C$1:$C$79)),ROW(17:17)),5)),\"\",INDEX($A$1:$G$79,SMALL(IF($C$1:$C$79=$S$1,ROW($C$1:$C$79)),ROW(17:17)),5))","v":""},{"$f":"IF(ISERROR(INDEX($A$1:$G$79,SMALL(IF($C$1:$C$79=$S$1,ROW($C$1:$C$79)),ROW(17:17)),7)),\"\",INDEX($A$1:$G$79,SMALL(IF($C$1:$C$79=$S$1,ROW($C$1:$C$79)),ROW(17:17)),7))","v":""},{"$f":"IF(ISERROR(INDEX($A$1:$H$79,SMALL(IF($C$1:$C$79=$S$1,ROW($C$1:$C$79)),ROW(17:17)),8)),\"\",INDEX($A$1:$H$79,SMALL(IF($C$1:$C$79=$S$1,ROW($C$1:$C$79)),ROW(17:17)),8))","v":""}," "]
[{"$f":"'Access & Input'!F25","v":0},{"$f":"'Access & Input'!G25","v":0},{"$f":"'Access & Input'!H25","v":0},{"$f":"'Access & Input'!B25","v":0},{"$f":"'Access & Input'!C25","v":0},{"$f":"'Access & Input'!D25","v":"Optional notes here"},"Participant Input",0,{"$f":"IF(ISERROR(INDEX($A$1:$G$79,SMALL(IF($A$1:$A$79=$I$1,ROW($A$1:$A$79)),ROW(18:18)),7)),\"\",INDEX($A$1:$G$79,SMALL(IF($A$1:$A$79=$I$1,ROW($A$1:$A$79)),ROW(18:18)),7))","v":""},{"$f":"IF(ISERROR(INDEX($A$1:$G$79,SMALL(IF($A$1:$A$79=$I$1,ROW($A$1:$A$79)),ROW(18:18)),4)),\"\",INDEX($A$1:$G$79,SMALL(IF($A$1:$A$79=$I$1,ROW($A$1:$A$79)),ROW(18:18)),4))","v":""},{"$f":"IF(ISERROR(INDEX($A$1:$G$79,SMALL(IF($A$1:$A$79=$I$1,ROW($A$1:$A$79)),ROW(18:18)),5)),\"\",INDEX($A$1:$G$79,SMALL(IF($A$1:$A$79=$I$1,ROW($A$1:$A$79)),ROW(18:18)),5))","v":""},{"$f":"IF(ISERROR(INDEX($A$1:$G$79,SMALL(IF($A$1:$A$79=$I$1,ROW($A$1:$A$79)),ROW(18:18)),6)),\"\",INDEX($A$1:$G$79,SMALL(IF($A$1:$A$79=$I$1,ROW($A$1:$A$79)),ROW(18:18)),6))","v":""},{"$f":"IF(ISERROR(INDEX($A$1:$H$79,SMALL(IF($A$1:$A$79=$I$1,ROW($A$1:$A$79)),ROW(18:18)),8)),\"\",INDEX($A$1:$H$79,SMALL(IF($A$1:$A$79=$I$1,ROW($A$1:$A$79)),ROW(18:18)),8))","v":""},{"$f":"IF(ISERROR(INDEX($A$1:$G$79,SMALL(IF($B$1:$B$79=$N$1,ROW($B$1:$B$79)),ROW(18:18)),6)),\"\",INDEX($A$1:$G$79,SMALL(IF($B$1:$B$79=$N$1,ROW($B$1:$B$79)),ROW(18:18)),6))","v":""},{"$f":"IF(ISERROR(INDEX($A$1:$G$79,SMALL(IF($B$1:$B$79=$N$1,ROW($B$1:$B$79)),ROW(18:18)),4)),\"\",INDEX($A$1:$G$79,SMALL(IF($B$1:$B$79=$N$1,ROW($B$1:$B$79)),ROW(18:18)),4))","v":""},{"$f":"IF(ISERROR(INDEX($A$1:$G$79,SMALL(IF($B$1:$B$79=$N$1,ROW($B$1:$B$79)),ROW(18:18)),5)),\"\",INDEX($A$1:$G$79,SMALL(IF($B$1:$B$79=$N$1,ROW($B$1:$B$79)),ROW(18:18)),5))","v":""},{"$f":"IF(ISERROR(INDEX($A$1:$G$79,SMALL(IF($B$1:$B$79=$N$1,ROW($B$1:$B$79)),ROW(18:18)),7)),\"\",INDEX($A$1:$G$79,SMALL(IF($B$1:$B$79=$N$1,ROW($B$1:$B$79)),ROW(18:18)),7))","v":""},{"$f":"IF(ISERROR(INDEX($A$1:$H$79,SMALL(IF($B$1:$B$79=$N$1,ROW($B$1:$B$79)),ROW(18:18)),8)),\"\",INDEX($A$1:$H$79,SMALL(IF($B$1:$B$79=$N$1,ROW($B$1:$B$79)),ROW(18:18)),8))","v":""},{"$f":"IF(ISERROR(INDEX($A$1:$G$79,SMALL(IF($C$1:$C$79=$S$1,ROW($C$1:$C$79)),ROW(18:18)),6)),\"\",INDEX($A$1:$G$79,SMALL(IF($C$1:$C$79=$S$1,ROW($C$1:$C$79)),ROW(18:18)),6))","v":""},{"$f":"IF(ISERROR(INDEX($A$1:$G$79,SMALL(IF($C$1:$C$79=$S$1,ROW($C$1:$C$79)),ROW(18:18)),4)),\"\",INDEX($A$1:$G$79,SMALL(IF($C$1:$C$79=$S$1,ROW($C$1:$C$79)),ROW(18:18)),4))","v":""},{"$f":"IF(ISERROR(INDEX($A$1:$G$79,SMALL(IF($C$1:$C$79=$S$1,ROW($C$1:$C$79)),ROW(18:18)),5)),\"\",INDEX($A$1:$G$79,SMALL(IF($C$1:$C$79=$S$1,ROW($C$1:$C$79)),ROW(18:18)),5))","v":""},{"$f":"IF(ISERROR(INDEX($A$1:$G$79,SMALL(IF($C$1:$C$79=$S$1,ROW($C$1:$C$79)),ROW(18:18)),7)),\"\",INDEX($A$1:$G$79,SMALL(IF($C$1:$C$79=$S$1,ROW($C$1:$C$79)),ROW(18:18)),7))","v":""},{"$f":"IF(ISERROR(INDEX($A$1:$H$79,SMALL(IF($C$1:$C$79=$S$1,ROW($C$1:$C$79)),ROW(18:18)),8)),\"\",INDEX($A$1:$H$79,SMALL(IF($C$1:$C$79=$S$1,ROW($C$1:$C$79)),ROW(18:18)),8))","v":""}," "]
[{"$f":"'Services & Housing'!F7","v":"Please select answer"},{"$f":"'Services & Housing'!G7","v":"Please select answer"},{"$f":"'Services & Housing'!H7","v":"Please select answer"},{"$f":"'Services & Housing'!B7","v":1},{"$f":"'Services & Housing'!C7","v":"Projects promote participant choice in services"},{"$f":"'Services & Housing'!D7","v":"Participants are able to choose from an array of services. Services offered are housing focused and include the following areas of support: employment and income, childhood and education, community connection, and stabilization to maintain housing.  These should be provided by linking to community-based services."},"Services",{"$f":"F21","v":"Optional notes here"},{"$f":"IF(ISERROR(INDEX($A$1:$G$79,SMALL(IF($A$1:$A$79=$I$1,ROW($A$1:$A$79)),ROW(19:19)),7)),\"\",INDEX($A$1:$G$79,SMALL(IF($A$1:$A$79=$I$1,ROW($A$1:$A$79)),ROW(19:19)),7))","v":""},{"$f":"IF(ISERROR(INDEX($A$1:$G$79,SMALL(IF($A$1:$A$79=$I$1,ROW($A$1:$A$79)),ROW(19:19)),4)),\"\",INDEX($A$1:$G$79,SMALL(IF($A$1:$A$79=$I$1,ROW($A$1:$A$79)),ROW(19:19)),4))","v":""},{"$f":"IF(ISERROR(INDEX($A$1:$G$79,SMALL(IF($A$1:$A$79=$I$1,ROW($A$1:$A$79)),ROW(19:19)),5)),\"\",INDEX($A$1:$G$79,SMALL(IF($A$1:$A$79=$I$1,ROW($A$1:$A$79)),ROW(19:19)),5))","v":""},{"$f":"IF(ISERROR(INDEX($A$1:$G$79,SMALL(IF($A$1:$A$79=$I$1,ROW($A$1:$A$79)),ROW(19:19)),6)),\"\",INDEX($A$1:$G$79,SMALL(IF($A$1:$A$79=$I$1,ROW($A$1:$A$79)),ROW(19:19)),6))","v":""},{"$f":"IF(ISERROR(INDEX($A$1:$H$79,SMALL(IF($A$1:$A$79=$I$1,ROW($A$1:$A$79)),ROW(19:19)),8)),\"\",INDEX($A$1:$H$79,SMALL(IF($A$1:$A$79=$I$1,ROW($A$1:$A$79)),ROW(19:19)),8))","v":""},{"$f":"IF(ISERROR(INDEX($A$1:$G$79,SMALL(IF($B$1:$B$79=$N$1,ROW($B$1:$B$79)),ROW(19:19)),6)),\"\",INDEX($A$1:$G$79,SMALL(IF($B$1:$B$79=$N$1,ROW($B$1:$B$79)),ROW(19:19)),6))","v":""},{"$f":"IF(ISERROR(INDEX($A$1:$G$79,SMALL(IF($B$1:$B$79=$N$1,ROW($B$1:$B$79)),ROW(19:19)),4)),\"\",INDEX($A$1:$G$79,SMALL(IF($B$1:$B$79=$N$1,ROW($B$1:$B$79)),ROW(19:19)),4))","v":""},{"$f":"IF(ISERROR(INDEX($A$1:$G$79,SMALL(IF($B$1:$B$79=$N$1,ROW($B$1:$B$79)),ROW(19:19)),5)),\"\",INDEX($A$1:$G$79,SMALL(IF($B$1:$B$79=$N$1,ROW($B$1:$B$79)),ROW(19:19)),5))","v":""},{"$f":"IF(ISERROR(INDEX($A$1:$G$79,SMALL(IF($B$1:$B$79=$N$1,ROW($B$1:$B$79)),ROW(19:19)),7)),\"\",INDEX($A$1:$G$79,SMALL(IF($B$1:$B$79=$N$1,ROW($B$1:$B$79)),ROW(19:19)),7))","v":""},{"$f":"IF(ISERROR(INDEX($A$1:$H$79,SMALL(IF($B$1:$B$79=$N$1,ROW($B$1:$B$79)),ROW(19:19)),8)),\"\",INDEX($A$1:$H$79,SMALL(IF($B$1:$B$79=$N$1,ROW($B$1:$B$79)),ROW(19:19)),8))","v":""},{"$f":"IF(ISERROR(INDEX($A$1:$G$79,SMALL(IF($C$1:$C$79=$S$1,ROW($C$1:$C$79)),ROW(19:19)),6)),\"\",INDEX($A$1:$G$79,SMALL(IF($C$1:$C$79=$S$1,ROW($C$1:$C$79)),ROW(19:19)),6))","v":""},{"$f":"IF(ISERROR(INDEX($A$1:$G$79,SMALL(IF($C$1:$C$79=$S$1,ROW($C$1:$C$79)),ROW(19:19)),4)),\"\",INDEX($A$1:$G$79,SMALL(IF($C$1:$C$79=$S$1,ROW($C$1:$C$79)),ROW(19:19)),4))","v":""},{"$f":"IF(ISERROR(INDEX($A$1:$G$79,SMALL(IF($C$1:$C$79=$S$1,ROW($C$1:$C$79)),ROW(19:19)),5)),\"\",INDEX($A$1:$G$79,SMALL(IF($C$1:$C$79=$S$1,ROW($C$1:$C$79)),ROW(19:19)),5))","v":""},{"$f":"IF(ISERROR(INDEX($A$1:$G$79,SMALL(IF($C$1:$C$79=$S$1,ROW($C$1:$C$79)),ROW(19:19)),7)),\"\",INDEX($A$1:$G$79,SMALL(IF($C$1:$C$79=$S$1,ROW($C$1:$C$79)),ROW(19:19)),7))","v":""},{"$f":"IF(ISERROR(INDEX($A$1:$H$79,SMALL(IF($C$1:$C$79=$S$1,ROW($C$1:$C$79)),ROW(19:19)),8)),\"\",INDEX($A$1:$H$79,SMALL(IF($C$1:$C$79=$S$1,ROW($C$1:$C$79)),ROW(19:19)),8))","v":""}," "]
[{"$f":"'Services & Housing'!F8","v":0},{"$f":"'Services & Housing'!G8","v":0},{"$f":"'Services & Housing'!H8","v":0},{"$f":"'Services & Housing'!B8","v":0},{"$f":"'Services & Housing'!C8","v":0},{"$f":"'Services & Housing'!D8","v":"Optional notes here"},"Services",0,{"$f":"IF(ISERROR(INDEX($A$1:$G$79,SMALL(IF($A$1:$A$79=$I$1,ROW($A$1:$A$79)),ROW(20:20)),7)),\"\",INDEX($A$1:$G$79,SMALL(IF($A$1:$A$79=$I$1,ROW($A$1:$A$79)),ROW(20:20)),7))","v":""},{"$f":"IF(ISERROR(INDEX($A$1:$G$79,SMALL(IF($A$1:$A$79=$I$1,ROW($A$1:$A$79)),ROW(20:20)),4)),\"\",INDEX($A$1:$G$79,SMALL(IF($A$1:$A$79=$I$1,ROW($A$1:$A$79)),ROW(20:20)),4))","v":""},{"$f":"IF(ISERROR(INDEX($A$1:$G$79,SMALL(IF($A$1:$A$79=$I$1,ROW($A$1:$A$79)),ROW(20:20)),5)),\"\",INDEX($A$1:$G$79,SMALL(IF($A$1:$A$79=$I$1,ROW($A$1:$A$79)),ROW(20:20)),5))","v":""},{"$f":"IF(ISERROR(INDEX($A$1:$G$79,SMALL(IF($A$1:$A$79=$I$1,ROW($A$1:$A$79)),ROW(20:20)),6)),\"\",INDEX($A$1:$G$79,SMALL(IF($A$1:$A$79=$I$1,ROW($A$1:$A$79)),ROW(20:20)),6))","v":""},{"$f":"IF(ISERROR(INDEX($A$1:$H$79,SMALL(IF($A$1:$A$79=$I$1,ROW($A$1:$A$79)),ROW(20:20)),8)),\"\",INDEX($A$1:$H$79,SMALL(IF($A$1:$A$79=$I$1,ROW($A$1:$A$79)),ROW(20:20)),8))","v":""},{"$f":"IF(ISERROR(INDEX($A$1:$G$79,SMALL(IF($B$1:$B$79=$N$1,ROW($B$1:$B$79)),ROW(20:20)),6)),\"\",INDEX($A$1:$G$79,SMALL(IF($B$1:$B$79=$N$1,ROW($B$1:$B$79)),ROW(20:20)),6))","v":""},{"$f":"IF(ISERROR(INDEX($A$1:$G$79,SMALL(IF($B$1:$B$79=$N$1,ROW($B$1:$B$79)),ROW(20:20)),4)),\"\",INDEX($A$1:$G$79,SMALL(IF($B$1:$B$79=$N$1,ROW($B$1:$B$79)),ROW(20:20)),4))","v":""},{"$f":"IF(ISERROR(INDEX($A$1:$G$79,SMALL(IF($B$1:$B$79=$N$1,ROW($B$1:$B$79)),ROW(20:20)),5)),\"\",INDEX($A$1:$G$79,SMALL(IF($B$1:$B$79=$N$1,ROW($B$1:$B$79)),ROW(20:20)),5))","v":""},{"$f":"IF(ISERROR(INDEX($A$1:$G$79,SMALL(IF($B$1:$B$79=$N$1,ROW($B$1:$B$79)),ROW(20:20)),7)),\"\",INDEX($A$1:$G$79,SMALL(IF($B$1:$B$79=$N$1,ROW($B$1:$B$79)),ROW(20:20)),7))","v":""},{"$f":"IF(ISERROR(INDEX($A$1:$H$79,SMALL(IF($B$1:$B$79=$N$1,ROW($B$1:$B$79)),ROW(20:20)),8)),\"\",INDEX($A$1:$H$79,SMALL(IF($B$1:$B$79=$N$1,ROW($B$1:$B$79)),ROW(20:20)),8))","v":""},{"$f":"IF(ISERROR(INDEX($A$1:$G$79,SMALL(IF($C$1:$C$79=$S$1,ROW($C$1:$C$79)),ROW(20:20)),6)),\"\",INDEX($A$1:$G$79,SMALL(IF($C$1:$C$79=$S$1,ROW($C$1:$C$79)),ROW(20:20)),6))","v":""},{"$f":"IF(ISERROR(INDEX($A$1:$G$79,SMALL(IF($C$1:$C$79=$S$1,ROW($C$1:$C$79)),ROW(20:20)),4)),\"\",INDEX($A$1:$G$79,SMALL(IF($C$1:$C$79=$S$1,ROW($C$1:$C$79)),ROW(20:20)),4))","v":""},{"$f":"IF(ISERROR(INDEX($A$1:$G$79,SMALL(IF($C$1:$C$79=$S$1,ROW($C$1:$C$79)),ROW(20:20)),5)),\"\",INDEX($A$1:$G$79,SMALL(IF($C$1:$C$79=$S$1,ROW($C$1:$C$79)),ROW(20:20)),5))","v":""},{"$f":"IF(ISERROR(INDEX($A$1:$G$79,SMALL(IF($C$1:$C$79=$S$1,ROW($C$1:$C$79)),ROW(20:20)),7)),\"\",INDEX($A$1:$G$79,SMALL(IF($C$1:$C$79=$S$1,ROW($C$1:$C$79)),ROW(20:20)),7))","v":""},{"$f":"IF(ISERROR(INDEX($A$1:$H$79,SMALL(IF($C$1:$C$79=$S$1,ROW($C$1:$C$79)),ROW(20:20)),8)),\"\",INDEX($A$1:$H$79,SMALL(IF($C$1:$C$79=$S$1,ROW($C$1:$C$79)),ROW(20:20)),8))","v":""}," "]
[{"$f":"'Services & Housing'!F9","v":"Please select answer"},{"$f":"'Services & Housing'!G9","v":"Please select answer"},{"$f":"'Services & Housing'!H9","v":"Please select answer"},{"$f":"'Services & Housing'!B9","v":2},{"$f":"'Services & Housing'!C9","v":"Person Centered Planning is a guiding principle of the service planning process"},{"$f":"'Services & Housing'!D9","v":"Person-centered Planning is a guiding principle of the service planning process"},"Services",{"$f":"F23","v":"Optional notes here"},{"$f":"IF(ISERROR(INDEX($A$1:$G$79,SMALL(IF($A$1:$A$79=$I$1,ROW($A$1:$A$79)),ROW(21:21)),7)),\"\",INDEX($A$1:$G$79,SMALL(IF($A$1:$A$79=$I$1,ROW($A$1:$A$79)),ROW(21:21)),7))","v":""},{"$f":"IF(ISERROR(INDEX($A$1:$G$79,SMALL(IF($A$1:$A$79=$I$1,ROW($A$1:$A$79)),ROW(21:21)),4)),\"\",INDEX($A$1:$G$79,SMALL(IF($A$1:$A$79=$I$1,ROW($A$1:$A$79)),ROW(21:21)),4))","v":""},{"$f":"IF(ISERROR(INDEX($A$1:$G$79,SMALL(IF($A$1:$A$79=$I$1,ROW($A$1:$A$79)),ROW(21:21)),5)),\"\",INDEX($A$1:$G$79,SMALL(IF($A$1:$A$79=$I$1,ROW($A$1:$A$79)),ROW(21:21)),5))","v":""},{"$f":"IF(ISERROR(INDEX($A$1:$G$79,SMALL(IF($A$1:$A$79=$I$1,ROW($A$1:$A$79)),ROW(21:21)),6)),\"\",INDEX($A$1:$G$79,SMALL(IF($A$1:$A$79=$I$1,ROW($A$1:$A$79)),ROW(21:21)),6))","v":""},{"$f":"IF(ISERROR(INDEX($A$1:$H$79,SMALL(IF($A$1:$A$79=$I$1,ROW($A$1:$A$79)),ROW(21:21)),8)),\"\",INDEX($A$1:$H$79,SMALL(IF($A$1:$A$79=$I$1,ROW($A$1:$A$79)),ROW(21:21)),8))","v":""},{"$f":"IF(ISERROR(INDEX($A$1:$G$79,SMALL(IF($B$1:$B$79=$N$1,ROW($B$1:$B$79)),ROW(21:21)),6)),\"\",INDEX($A$1:$G$79,SMALL(IF($B$1:$B$79=$N$1,ROW($B$1:$B$79)),ROW(21:21)),6))","v":""},{"$f":"IF(ISERROR(INDEX($A$1:$G$79,SMALL(IF($B$1:$B$79=$N$1,ROW($B$1:$B$79)),ROW(21:21)),4)),\"\",INDEX($A$1:$G$79,SMALL(IF($B$1:$B$79=$N$1,ROW($B$1:$B$79)),ROW(21:21)),4))","v":""},{"$f":"IF(ISERROR(INDEX($A$1:$G$79,SMALL(IF($B$1:$B$79=$N$1,ROW($B$1:$B$79)),ROW(21:21)),5)),\"\",INDEX($A$1:$G$79,SMALL(IF($B$1:$B$79=$N$1,ROW($B$1:$B$79)),ROW(21:21)),5))","v":""},{"$f":"IF(ISERROR(INDEX($A$1:$G$79,SMALL(IF($B$1:$B$79=$N$1,ROW($B$1:$B$79)),ROW(21:21)),7)),\"\",INDEX($A$1:$G$79,SMALL(IF($B$1:$B$79=$N$1,ROW($B$1:$B$79)),ROW(21:21)),7))","v":""},{"$f":"IF(ISERROR(INDEX($A$1:$H$79,SMALL(IF($B$1:$B$79=$N$1,ROW($B$1:$B$79)),ROW(21:21)),8)),\"\",INDEX($A$1:$H$79,SMALL(IF($B$1:$B$79=$N$1,ROW($B$1:$B$79)),ROW(21:21)),8))","v":""},{"$f":"IF(ISERROR(INDEX($A$1:$G$79,SMALL(IF($C$1:$C$79=$S$1,ROW($C$1:$C$79)),ROW(21:21)),6)),\"\",INDEX($A$1:$G$79,SMALL(IF($C$1:$C$79=$S$1,ROW($C$1:$C$79)),ROW(21:21)),6))","v":""},{"$f":"IF(ISERROR(INDEX($A$1:$G$79,SMALL(IF($C$1:$C$79=$S$1,ROW($C$1:$C$79)),ROW(21:21)),4)),\"\",INDEX($A$1:$G$79,SMALL(IF($C$1:$C$79=$S$1,ROW($C$1:$C$79)),ROW(21:21)),4))","v":""},{"$f":"IF(ISERROR(INDEX($A$1:$G$79,SMALL(IF($C$1:$C$79=$S$1,ROW($C$1:$C$79)),ROW(21:21)),5)),\"\",INDEX($A$1:$G$79,SMALL(IF($C$1:$C$79=$S$1,ROW($C$1:$C$79)),ROW(21:21)),5))","v":""},{"$f":"IF(ISERROR(INDEX($A$1:$G$79,SMALL(IF($C$1:$C$79=$S$1,ROW($C$1:$C$79)),ROW(21:21)),7)),\"\",INDEX($A$1:$G$79,SMALL(IF($C$1:$C$79=$S$1,ROW($C$1:$C$79)),ROW(21:21)),7))","v":""},{"$f":"IF(ISERROR(INDEX($A$1:$H$79,SMALL(IF($C$1:$C$79=$S$1,ROW($C$1:$C$79)),ROW(21:21)),8)),\"\",INDEX($A$1:$H$79,SMALL(IF($C$1:$C$79=$S$1,ROW($C$1:$C$79)),ROW(21:21)),8))","v":""}," "]
[{"$f":"'Services & Housing'!F10","v":0},{"$f":"'Services & Housing'!G10","v":0},{"$f":"'Services & Housing'!H10","v":0},{"$f":"'Services & Housing'!B10","v":0},{"$f":"'Services & Housing'!C10","v":0},{"$f":"'Services & Housing'!D10","v":"Optional notes here"},"Services",0,{"$f":"IF(ISERROR(INDEX($A$1:$G$79,SMALL(IF($A$1:$A$79=$I$1,ROW($A$1:$A$79)),ROW(22:22)),7)),\"\",INDEX($A$1:$G$79,SMALL(IF($A$1:$A$79=$I$1,ROW($A$1:$A$79)),ROW(22:22)),7))","v":""},{"$f":"IF(ISERROR(INDEX($A$1:$G$79,SMALL(IF($A$1:$A$79=$I$1,ROW($A$1:$A$79)),ROW(22:22)),4)),\"\",INDEX($A$1:$G$79,SMALL(IF($A$1:$A$79=$I$1,ROW($A$1:$A$79)),ROW(22:22)),4))","v":""},{"$f":"IF(ISERROR(INDEX($A$1:$G$79,SMALL(IF($A$1:$A$79=$I$1,ROW($A$1:$A$79)),ROW(22:22)),5)),\"\",INDEX($A$1:$G$79,SMALL(IF($A$1:$A$79=$I$1,ROW($A$1:$A$79)),ROW(22:22)),5))","v":""},{"$f":"IF(ISERROR(INDEX($A$1:$G$79,SMALL(IF($A$1:$A$79=$I$1,ROW($A$1:$A$79)),ROW(22:22)),6)),\"\",INDEX($A$1:$G$79,SMALL(IF($A$1:$A$79=$I$1,ROW($A$1:$A$79)),ROW(22:22)),6))","v":""},{"$f":"IF(ISERROR(INDEX($A$1:$H$79,SMALL(IF($A$1:$A$79=$I$1,ROW($A$1:$A$79)),ROW(22:22)),8)),\"\",INDEX($A$1:$H$79,SMALL(IF($A$1:$A$79=$I$1,ROW($A$1:$A$79)),ROW(22:22)),8))","v":""},{"$f":"IF(ISERROR(INDEX($A$1:$G$79,SMALL(IF($B$1:$B$79=$N$1,ROW($B$1:$B$79)),ROW(22:22)),6)),\"\",INDEX($A$1:$G$79,SMALL(IF($B$1:$B$79=$N$1,ROW($B$1:$B$79)),ROW(22:22)),6))","v":""},{"$f":"IF(ISERROR(INDEX($A$1:$G$79,SMALL(IF($B$1:$B$79=$N$1,ROW($B$1:$B$79)),ROW(22:22)),4)),\"\",INDEX($A$1:$G$79,SMALL(IF($B$1:$B$79=$N$1,ROW($B$1:$B$79)),ROW(22:22)),4))","v":""},{"$f":"IF(ISERROR(INDEX($A$1:$G$79,SMALL(IF($B$1:$B$79=$N$1,ROW($B$1:$B$79)),ROW(22:22)),5)),\"\",INDEX($A$1:$G$79,SMALL(IF($B$1:$B$79=$N$1,ROW($B$1:$B$79)),ROW(22:22)),5))","v":""},{"$f":"IF(ISERROR(INDEX($A$1:$G$79,SMALL(IF($B$1:$B$79=$N$1,ROW($B$1:$B$79)),ROW(22:22)),7)),\"\",INDEX($A$1:$G$79,SMALL(IF($B$1:$B$79=$N$1,ROW($B$1:$B$79)),ROW(22:22)),7))","v":""},{"$f":"IF(ISERROR(INDEX($A$1:$H$79,SMALL(IF($B$1:$B$79=$N$1,ROW($B$1:$B$79)),ROW(22:22)),8)),\"\",INDEX($A$1:$H$79,SMALL(IF($B$1:$B$79=$N$1,ROW($B$1:$B$79)),ROW(22:22)),8))","v":""},{"$f":"IF(ISERROR(INDEX($A$1:$G$79,SMALL(IF($C$1:$C$79=$S$1,ROW($C$1:$C$79)),ROW(22:22)),6)),\"\",INDEX($A$1:$G$79,SMALL(IF($C$1:$C$79=$S$1,ROW($C$1:$C$79)),ROW(22:22)),6))","v":""},{"$f":"IF(ISERROR(INDEX($A$1:$G$79,SMALL(IF($C$1:$C$79=$S$1,ROW($C$1:$C$79)),ROW(22:22)),4)),\"\",INDEX($A$1:$G$79,SMALL(IF($C$1:$C$79=$S$1,ROW($C$1:$C$79)),ROW(22:22)),4))","v":""},{"$f":"IF(ISERROR(INDEX($A$1:$G$79,SMALL(IF($C$1:$C$79=$S$1,ROW($C$1:$C$79)),ROW(22:22)),5)),\"\",INDEX($A$1:$G$79,SMALL(IF($C$1:$C$79=$S$1,ROW($C$1:$C$79)),ROW(22:22)),5))","v":""},{"$f":"IF(ISERROR(INDEX($A$1:$G$79,SMALL(IF($C$1:$C$79=$S$1,ROW($C$1:$C$79)),ROW(22:22)),7)),\"\",INDEX($A$1:$G$79,SMALL(IF($C$1:$C$79=$S$1,ROW($C$1:$C$79)),ROW(22:22)),7))","v":""},{"$f":"IF(ISERROR(INDEX($A$1:$H$79,SMALL(IF($C$1:$C$79=$S$1,ROW($C$1:$C$79)),ROW(22:22)),8)),\"\",INDEX($A$1:$H$79,SMALL(IF($C$1:$C$79=$S$1,ROW($C$1:$C$79)),ROW(22:22)),8))","v":""}," "]
[{"$f":"'Services & Housing'!F11","v":"Please select answer"},{"$f":"'Services & Housing'!G11","v":"Please select answer"},{"$f":"'Services & Housing'!H11","v":"Please select answer"},{"$f":"'Services & Housing'!B11","v":3},{"$f":"'Services & Housing'!C11","v":"Service support is as permanent as the housing"},{"$f":"'Services & Housing'!D11","v":"Service connections are permanently available and accessible for participants in Permanent Supportive Housing.  Rapid Re-Housing projects should, at a minimum, be prepared to offer services for up to 6 months after the rental assistance ends. In emergency shelter and transitional housing, services are available as long as the participant resides in the unit or bed – and up to 6 months following exit from transitional housing.  "},"Services",{"$f":"F25","v":"Optional notes here"},{"$f":"IF(ISERROR(INDEX($A$1:$G$79,SMALL(IF($A$1:$A$79=$I$1,ROW($A$1:$A$79)),ROW(23:23)),7)),\"\",INDEX($A$1:$G$79,SMALL(IF($A$1:$A$79=$I$1,ROW($A$1:$A$79)),ROW(23:23)),7))","v":""},{"$f":"IF(ISERROR(INDEX($A$1:$G$79,SMALL(IF($A$1:$A$79=$I$1,ROW($A$1:$A$79)),ROW(23:23)),4)),\"\",INDEX($A$1:$G$79,SMALL(IF($A$1:$A$79=$I$1,ROW($A$1:$A$79)),ROW(23:23)),4))","v":""},{"$f":"IF(ISERROR(INDEX($A$1:$G$79,SMALL(IF($A$1:$A$79=$I$1,ROW($A$1:$A$79)),ROW(23:23)),5)),\"\",INDEX($A$1:$G$79,SMALL(IF($A$1:$A$79=$I$1,ROW($A$1:$A$79)),ROW(23:23)),5))","v":""},{"$f":"IF(ISERROR(INDEX($A$1:$G$79,SMALL(IF($A$1:$A$79=$I$1,ROW($A$1:$A$79)),ROW(23:23)),6)),\"\",INDEX($A$1:$G$79,SMALL(IF($A$1:$A$79=$I$1,ROW($A$1:$A$79)),ROW(23:23)),6))","v":""},{"$f":"IF(ISERROR(INDEX($A$1:$H$79,SMALL(IF($A$1:$A$79=$I$1,ROW($A$1:$A$79)),ROW(23:23)),8)),\"\",INDEX($A$1:$H$79,SMALL(IF($A$1:$A$79=$I$1,ROW($A$1:$A$79)),ROW(23:23)),8))","v":""},{"$f":"IF(ISERROR(INDEX($A$1:$G$79,SMALL(IF($B$1:$B$79=$N$1,ROW($B$1:$B$79)),ROW(23:23)),6)),\"\",INDEX($A$1:$G$79,SMALL(IF($B$1:$B$79=$N$1,ROW($B$1:$B$79)),ROW(23:23)),6))","v":""},{"$f":"IF(ISERROR(INDEX($A$1:$G$79,SMALL(IF($B$1:$B$79=$N$1,ROW($B$1:$B$79)),ROW(23:23)),4)),\"\",INDEX($A$1:$G$79,SMALL(IF($B$1:$B$79=$N$1,ROW($B$1:$B$79)),ROW(23:23)),4))","v":""},{"$f":"IF(ISERROR(INDEX($A$1:$G$79,SMALL(IF($B$1:$B$79=$N$1,ROW($B$1:$B$79)),ROW(23:23)),5)),\"\",INDEX($A$1:$G$79,SMALL(IF($B$1:$B$79=$N$1,ROW($B$1:$B$79)),ROW(23:23)),5))","v":""},{"$f":"IF(ISERROR(INDEX($A$1:$G$79,SMALL(IF($B$1:$B$79=$N$1,ROW($B$1:$B$79)),ROW(23:23)),7)),\"\",INDEX($A$1:$G$79,SMALL(IF($B$1:$B$79=$N$1,ROW($B$1:$B$79)),ROW(23:23)),7))","v":""},{"$f":"IF(ISERROR(INDEX($A$1:$H$79,SMALL(IF($B$1:$B$79=$N$1,ROW($B$1:$B$79)),ROW(23:23)),8)),\"\",INDEX($A$1:$H$79,SMALL(IF($B$1:$B$79=$N$1,ROW($B$1:$B$79)),ROW(23:23)),8))","v":""},{"$f":"IF(ISERROR(INDEX($A$1:$G$79,SMALL(IF($C$1:$C$79=$S$1,ROW($C$1:$C$79)),ROW(23:23)),6)),\"\",INDEX($A$1:$G$79,SMALL(IF($C$1:$C$79=$S$1,ROW($C$1:$C$79)),ROW(23:23)),6))","v":""},{"$f":"IF(ISERROR(INDEX($A$1:$G$79,SMALL(IF($C$1:$C$79=$S$1,ROW($C$1:$C$79)),ROW(23:23)),4)),\"\",INDEX($A$1:$G$79,SMALL(IF($C$1:$C$79=$S$1,ROW($C$1:$C$79)),ROW(23:23)),4))","v":""},{"$f":"IF(ISERROR(INDEX($A$1:$G$79,SMALL(IF($C$1:$C$79=$S$1,ROW($C$1:$C$79)),ROW(23:23)),5)),\"\",INDEX($A$1:$G$79,SMALL(IF($C$1:$C$79=$S$1,ROW($C$1:$C$79)),ROW(23:23)),5))","v":""},{"$f":"IF(ISERROR(INDEX($A$1:$G$79,SMALL(IF($C$1:$C$79=$S$1,ROW($C$1:$C$79)),ROW(23:23)),7)),\"\",INDEX($A$1:$G$79,SMALL(IF($C$1:$C$79=$S$1,ROW($C$1:$C$79)),ROW(23:23)),7))","v":""},{"$f":"IF(ISERROR(INDEX($A$1:$H$79,SMALL(IF($C$1:$C$79=$S$1,ROW($C$1:$C$79)),ROW(23:23)),8)),\"\",INDEX($A$1:$H$79,SMALL(IF($C$1:$C$79=$S$1,ROW($C$1:$C$79)),ROW(23:23)),8))","v":""}," "]
[{"$f":"'Services & Housing'!F12","v":0},{"$f":"'Services & Housing'!G12","v":0},{"$f":"'Services & Housing'!H12","v":0},{"$f":"'Services & Housing'!B12","v":0},{"$f":"'Services & Housing'!C12","v":0},{"$f":"'Services & Housing'!D12","v":"Optional notes here"},"Services",0,{"$f":"IF(ISERROR(INDEX($A$1:$G$79,SMALL(IF($A$1:$A$79=$I$1,ROW($A$1:$A$79)),ROW(24:24)),7)),\"\",INDEX($A$1:$G$79,SMALL(IF($A$1:$A$79=$I$1,ROW($A$1:$A$79)),ROW(24:24)),7))","v":""},{"$f":"IF(ISERROR(INDEX($A$1:$G$79,SMALL(IF($A$1:$A$79=$I$1,ROW($A$1:$A$79)),ROW(24:24)),4)),\"\",INDEX($A$1:$G$79,SMALL(IF($A$1:$A$79=$I$1,ROW($A$1:$A$79)),ROW(24:24)),4))","v":""},{"$f":"IF(ISERROR(INDEX($A$1:$G$79,SMALL(IF($A$1:$A$79=$I$1,ROW($A$1:$A$79)),ROW(24:24)),5)),\"\",INDEX($A$1:$G$79,SMALL(IF($A$1:$A$79=$I$1,ROW($A$1:$A$79)),ROW(24:24)),5))","v":""},{"$f":"IF(ISERROR(INDEX($A$1:$G$79,SMALL(IF($A$1:$A$79=$I$1,ROW($A$1:$A$79)),ROW(24:24)),6)),\"\",INDEX($A$1:$G$79,SMALL(IF($A$1:$A$79=$I$1,ROW($A$1:$A$79)),ROW(24:24)),6))","v":""},{"$f":"IF(ISERROR(INDEX($A$1:$H$79,SMALL(IF($A$1:$A$79=$I$1,ROW($A$1:$A$79)),ROW(24:24)),8)),\"\",INDEX($A$1:$H$79,SMALL(IF($A$1:$A$79=$I$1,ROW($A$1:$A$79)),ROW(24:24)),8))","v":""},{"$f":"IF(ISERROR(INDEX($A$1:$G$79,SMALL(IF($B$1:$B$79=$N$1,ROW($B$1:$B$79)),ROW(24:24)),6)),\"\",INDEX($A$1:$G$79,SMALL(IF($B$1:$B$79=$N$1,ROW($B$1:$B$79)),ROW(24:24)),6))","v":""},{"$f":"IF(ISERROR(INDEX($A$1:$G$79,SMALL(IF($B$1:$B$79=$N$1,ROW($B$1:$B$79)),ROW(24:24)),4)),\"\",INDEX($A$1:$G$79,SMALL(IF($B$1:$B$79=$N$1,ROW($B$1:$B$79)),ROW(24:24)),4))","v":""},{"$f":"IF(ISERROR(INDEX($A$1:$G$79,SMALL(IF($B$1:$B$79=$N$1,ROW($B$1:$B$79)),ROW(24:24)),5)),\"\",INDEX($A$1:$G$79,SMALL(IF($B$1:$B$79=$N$1,ROW($B$1:$B$79)),ROW(24:24)),5))","v":""},{"$f":"IF(ISERROR(INDEX($A$1:$G$79,SMALL(IF($B$1:$B$79=$N$1,ROW($B$1:$B$79)),ROW(24:24)),7)),\"\",INDEX($A$1:$G$79,SMALL(IF($B$1:$B$79=$N$1,ROW($B$1:$B$79)),ROW(24:24)),7))","v":""},{"$f":"IF(ISERROR(INDEX($A$1:$H$79,SMALL(IF($B$1:$B$79=$N$1,ROW($B$1:$B$79)),ROW(24:24)),8)),\"\",INDEX($A$1:$H$79,SMALL(IF($B$1:$B$79=$N$1,ROW($B$1:$B$79)),ROW(24:24)),8))","v":""},{"$f":"IF(ISERROR(INDEX($A$1:$G$79,SMALL(IF($C$1:$C$79=$S$1,ROW($C$1:$C$79)),ROW(24:24)),6)),\"\",INDEX($A$1:$G$79,SMALL(IF($C$1:$C$79=$S$1,ROW($C$1:$C$79)),ROW(24:24)),6))","v":""},{"$f":"IF(ISERROR(INDEX($A$1:$G$79,SMALL(IF($C$1:$C$79=$S$1,ROW($C$1:$C$79)),ROW(24:24)),4)),\"\",INDEX($A$1:$G$79,SMALL(IF($C$1:$C$79=$S$1,ROW($C$1:$C$79)),ROW(24:24)),4))","v":""},{"$f":"IF(ISERROR(INDEX($A$1:$G$79,SMALL(IF($C$1:$C$79=$S$1,ROW($C$1:$C$79)),ROW(24:24)),5)),\"\",INDEX($A$1:$G$79,SMALL(IF($C$1:$C$79=$S$1,ROW($C$1:$C$79)),ROW(24:24)),5))","v":""},{"$f":"IF(ISERROR(INDEX($A$1:$G$79,SMALL(IF($C$1:$C$79=$S$1,ROW($C$1:$C$79)),ROW(24:24)),7)),\"\",INDEX($A$1:$G$79,SMALL(IF($C$1:$C$79=$S$1,ROW($C$1:$C$79)),ROW(24:24)),7))","v":""},{"$f":"IF(ISERROR(INDEX($A$1:$H$79,SMALL(IF($C$1:$C$79=$S$1,ROW($C$1:$C$79)),ROW(24:24)),8)),\"\",INDEX($A$1:$H$79,SMALL(IF($C$1:$C$79=$S$1,ROW($C$1:$C$79)),ROW(24:24)),8))","v":""}," "]
[{"$f":"'Services & Housing'!F13","v":"Please select answer"},{"$f":"'Services & Housing'!G13","v":"Please select answer"},{"$f":"'Services & Housing'!H13","v":"Please select answer"},{"$f":"'Services & Housing'!B13","v":4},{"$f":"'Services & Housing'!C13","v":"Services are continued despite change in housing status or placement"},{"$f":"'Services & Housing'!D13","v":"Wherever possible, participants continue to be offered services even if they lose their housing unit or bed (for congregate projects), or if they are placed in a short-term inpatient treatment. Ideally, the service relationship should continue, despite a service hiatus during some institutional stays.  "},"Services",{"$f":"F27","v":"Optional notes here"},{"$f":"IF(ISERROR(INDEX($A$1:$G$79,SMALL(IF($A$1:$A$79=$I$1,ROW($A$1:$A$79)),ROW(25:25)),7)),\"\",INDEX($A$1:$G$79,SMALL(IF($A$1:$A$79=$I$1,ROW($A$1:$A$79)),ROW(25:25)),7))","v":""},{"$f":"IF(ISERROR(INDEX($A$1:$G$79,SMALL(IF($A$1:$A$79=$I$1,ROW($A$1:$A$79)),ROW(25:25)),4)),\"\",INDEX($A$1:$G$79,SMALL(IF($A$1:$A$79=$I$1,ROW($A$1:$A$79)),ROW(25:25)),4))","v":""},{"$f":"IF(ISERROR(INDEX($A$1:$G$79,SMALL(IF($A$1:$A$79=$I$1,ROW($A$1:$A$79)),ROW(25:25)),5)),\"\",INDEX($A$1:$G$79,SMALL(IF($A$1:$A$79=$I$1,ROW($A$1:$A$79)),ROW(25:25)),5))","v":""},{"$f":"IF(ISERROR(INDEX($A$1:$G$79,SMALL(IF($A$1:$A$79=$I$1,ROW($A$1:$A$79)),ROW(25:25)),6)),\"\",INDEX($A$1:$G$79,SMALL(IF($A$1:$A$79=$I$1,ROW($A$1:$A$79)),ROW(25:25)),6))","v":""},{"$f":"IF(ISERROR(INDEX($A$1:$H$79,SMALL(IF($A$1:$A$79=$I$1,ROW($A$1:$A$79)),ROW(25:25)),8)),\"\",INDEX($A$1:$H$79,SMALL(IF($A$1:$A$79=$I$1,ROW($A$1:$A$79)),ROW(25:25)),8))","v":""},{"$f":"IF(ISERROR(INDEX($A$1:$G$79,SMALL(IF($B$1:$B$79=$N$1,ROW($B$1:$B$79)),ROW(25:25)),6)),\"\",INDEX($A$1:$G$79,SMALL(IF($B$1:$B$79=$N$1,ROW($B$1:$B$79)),ROW(25:25)),6))","v":""},{"$f":"IF(ISERROR(INDEX($A$1:$G$79,SMALL(IF($B$1:$B$79=$N$1,ROW($B$1:$B$79)),ROW(25:25)),4)),\"\",INDEX($A$1:$G$79,SMALL(IF($B$1:$B$79=$N$1,ROW($B$1:$B$79)),ROW(25:25)),4))","v":""},{"$f":"IF(ISERROR(INDEX($A$1:$G$79,SMALL(IF($B$1:$B$79=$N$1,ROW($B$1:$B$79)),ROW(25:25)),5)),\"\",INDEX($A$1:$G$79,SMALL(IF($B$1:$B$79=$N$1,ROW($B$1:$B$79)),ROW(25:25)),5))","v":""},{"$f":"IF(ISERROR(INDEX($A$1:$G$79,SMALL(IF($B$1:$B$79=$N$1,ROW($B$1:$B$79)),ROW(25:25)),7)),\"\",INDEX($A$1:$G$79,SMALL(IF($B$1:$B$79=$N$1,ROW($B$1:$B$79)),ROW(25:25)),7))","v":""},{"$f":"IF(ISERROR(INDEX($A$1:$H$79,SMALL(IF($B$1:$B$79=$N$1,ROW($B$1:$B$79)),ROW(25:25)),8)),\"\",INDEX($A$1:$H$79,SMALL(IF($B$1:$B$79=$N$1,ROW($B$1:$B$79)),ROW(25:25)),8))","v":""},{"$f":"IF(ISERROR(INDEX($A$1:$G$79,SMALL(IF($C$1:$C$79=$S$1,ROW($C$1:$C$79)),ROW(25:25)),6)),\"\",INDEX($A$1:$G$79,SMALL(IF($C$1:$C$79=$S$1,ROW($C$1:$C$79)),ROW(25:25)),6))","v":""},{"$f":"IF(ISERROR(INDEX($A$1:$G$79,SMALL(IF($C$1:$C$79=$S$1,ROW($C$1:$C$79)),ROW(25:25)),4)),\"\",INDEX($A$1:$G$79,SMALL(IF($C$1:$C$79=$S$1,ROW($C$1:$C$79)),ROW(25:25)),4))","v":""},{"$f":"IF(ISERROR(INDEX($A$1:$G$79,SMALL(IF($C$1:$C$79=$S$1,ROW($C$1:$C$79)),ROW(25:25)),5)),\"\",INDEX($A$1:$G$79,SMALL(IF($C$1:$C$79=$S$1,ROW($C$1:$C$79)),ROW(25:25)),5))","v":""},{"$f":"IF(ISERROR(INDEX($A$1:$G$79,SMALL(IF($C$1:$C$79=$S$1,ROW($C$1:$C$79)),ROW(25:25)),7)),\"\",INDEX($A$1:$G$79,SMALL(IF($C$1:$C$79=$S$1,ROW($C$1:$C$79)),ROW(25:25)),7))","v":""},{"$f":"IF(ISERROR(INDEX($A$1:$H$79,SMALL(IF($C$1:$C$79=$S$1,ROW($C$1:$C$79)),ROW(25:25)),8)),\"\",INDEX($A$1:$H$79,SMALL(IF($C$1:$C$79=$S$1,ROW($C$1:$C$79)),ROW(25:25)),8))","v":""}," "]
[{"$f":"'Services & Housing'!F14","v":0},{"$f":"'Services & Housing'!G14","v":0},{"$f":"'Services & Housing'!H14","v":0},{"$f":"'Services & Housing'!B14","v":0},{"$f":"'Services & Housing'!C14","v":0},{"$f":"'Services & Housing'!D14","v":"Optional notes here"},"Services",0,{"$f":"IF(ISERROR(INDEX($A$1:$G$79,SMALL(IF($A$1:$A$79=$I$1,ROW($A$1:$A$79)),ROW(26:26)),7)),\"\",INDEX($A$1:$G$79,SMALL(IF($A$1:$A$79=$I$1,ROW($A$1:$A$79)),ROW(26:26)),7))","v":""},{"$f":"IF(ISERROR(INDEX($A$1:$G$79,SMALL(IF($A$1:$A$79=$I$1,ROW($A$1:$A$79)),ROW(26:26)),4)),\"\",INDEX($A$1:$G$79,SMALL(IF($A$1:$A$79=$I$1,ROW($A$1:$A$79)),ROW(26:26)),4))","v":""},{"$f":"IF(ISERROR(INDEX($A$1:$G$79,SMALL(IF($A$1:$A$79=$I$1,ROW($A$1:$A$79)),ROW(26:26)),5)),\"\",INDEX($A$1:$G$79,SMALL(IF($A$1:$A$79=$I$1,ROW($A$1:$A$79)),ROW(26:26)),5))","v":""},{"$f":"IF(ISERROR(INDEX($A$1:$G$79,SMALL(IF($A$1:$A$79=$I$1,ROW($A$1:$A$79)),ROW(26:26)),6)),\"\",INDEX($A$1:$G$79,SMALL(IF($A$1:$A$79=$I$1,ROW($A$1:$A$79)),ROW(26:26)),6))","v":""},{"$f":"IF(ISERROR(INDEX($A$1:$H$79,SMALL(IF($A$1:$A$79=$I$1,ROW($A$1:$A$79)),ROW(26:26)),8)),\"\",INDEX($A$1:$H$79,SMALL(IF($A$1:$A$79=$I$1,ROW($A$1:$A$79)),ROW(26:26)),8))","v":""},{"$f":"IF(ISERROR(INDEX($A$1:$G$79,SMALL(IF($B$1:$B$79=$N$1,ROW($B$1:$B$79)),ROW(26:26)),6)),\"\",INDEX($A$1:$G$79,SMALL(IF($B$1:$B$79=$N$1,ROW($B$1:$B$79)),ROW(26:26)),6))","v":""},{"$f":"IF(ISERROR(INDEX($A$1:$G$79,SMALL(IF($B$1:$B$79=$N$1,ROW($B$1:$B$79)),ROW(26:26)),4)),\"\",INDEX($A$1:$G$79,SMALL(IF($B$1:$B$79=$N$1,ROW($B$1:$B$79)),ROW(26:26)),4))","v":""},{"$f":"IF(ISERROR(INDEX($A$1:$G$79,SMALL(IF($B$1:$B$79=$N$1,ROW($B$1:$B$79)),ROW(26:26)),5)),\"\",INDEX($A$1:$G$79,SMALL(IF($B$1:$B$79=$N$1,ROW($B$1:$B$79)),ROW(26:26)),5))","v":""},{"$f":"IF(ISERROR(INDEX($A$1:$G$79,SMALL(IF($B$1:$B$79=$N$1,ROW($B$1:$B$79)),ROW(26:26)),7)),\"\",INDEX($A$1:$G$79,SMALL(IF($B$1:$B$79=$N$1,ROW($B$1:$B$79)),ROW(26:26)),7))","v":""},{"$f":"IF(ISERROR(INDEX($A$1:$H$79,SMALL(IF($B$1:$B$79=$N$1,ROW($B$1:$B$79)),ROW(26:26)),8)),\"\",INDEX($A$1:$H$79,SMALL(IF($B$1:$B$79=$N$1,ROW($B$1:$B$79)),ROW(26:26)),8))","v":""},{"$f":"IF(ISERROR(INDEX($A$1:$G$79,SMALL(IF($C$1:$C$79=$S$1,ROW($C$1:$C$79)),ROW(26:26)),6)),\"\",INDEX($A$1:$G$79,SMALL(IF($C$1:$C$79=$S$1,ROW($C$1:$C$79)),ROW(26:26)),6))","v":""},{"$f":"IF(ISERROR(INDEX($A$1:$G$79,SMALL(IF($C$1:$C$79=$S$1,ROW($C$1:$C$79)),ROW(26:26)),4)),\"\",INDEX($A$1:$G$79,SMALL(IF($C$1:$C$79=$S$1,ROW($C$1:$C$79)),ROW(26:26)),4))","v":""},{"$f":"IF(ISERROR(INDEX($A$1:$G$79,SMALL(IF($C$1:$C$79=$S$1,ROW($C$1:$C$79)),ROW(26:26)),5)),\"\",INDEX($A$1:$G$79,SMALL(IF($C$1:$C$79=$S$1,ROW($C$1:$C$79)),ROW(26:26)),5))","v":""},{"$f":"IF(ISERROR(INDEX($A$1:$G$79,SMALL(IF($C$1:$C$79=$S$1,ROW($C$1:$C$79)),ROW(26:26)),7)),\"\",INDEX($A$1:$G$79,SMALL(IF($C$1:$C$79=$S$1,ROW($C$1:$C$79)),ROW(26:26)),7))","v":""},{"$f":"IF(ISERROR(INDEX($A$1:$H$79,SMALL(IF($C$1:$C$79=$S$1,ROW($C$1:$C$79)),ROW(26:26)),8)),\"\",INDEX($A$1:$H$79,SMALL(IF($C$1:$C$79=$S$1,ROW($C$1:$C$79)),ROW(26:26)),8))","v":""}," "]
[{"$f":"'Services & Housing'!F15","v":"Please select answer"},{"$f":"'Services & Housing'!G15","v":"Please select answer"},{"$f":"'Services & Housing'!H15","v":"Please select answer"},{"$f":"'Services & Housing'!B15","v":5},{"$f":"'Services & Housing'!C15","v":"Participant engagement is a core component of service delivery"},{"$f":"'Services & Housing'!D15","v":"Staff provide effective services by developing relationships with participants that provide immediate needs and safety, develop trust and common ground, making warm hand-offs to other mainstream service providers, and clearly explain staff roles.  Engagement is regular and relationships are developed over time. "},"Services",{"$f":"F29","v":"Optional notes here"},{"$f":"IF(ISERROR(INDEX($A$1:$G$79,SMALL(IF($A$1:$A$79=$I$1,ROW($A$1:$A$79)),ROW(27:27)),7)),\"\",INDEX($A$1:$G$79,SMALL(IF($A$1:$A$79=$I$1,ROW($A$1:$A$79)),ROW(27:27)),7))","v":""},{"$f":"IF(ISERROR(INDEX($A$1:$G$79,SMALL(IF($A$1:$A$79=$I$1,ROW($A$1:$A$79)),ROW(27:27)),4)),\"\",INDEX($A$1:$G$79,SMALL(IF($A$1:$A$79=$I$1,ROW($A$1:$A$79)),ROW(27:27)),4))","v":""},{"$f":"IF(ISERROR(INDEX($A$1:$G$79,SMALL(IF($A$1:$A$79=$I$1,ROW($A$1:$A$79)),ROW(27:27)),5)),\"\",INDEX($A$1:$G$79,SMALL(IF($A$1:$A$79=$I$1,ROW($A$1:$A$79)),ROW(27:27)),5))","v":""},{"$f":"IF(ISERROR(INDEX($A$1:$G$79,SMALL(IF($A$1:$A$79=$I$1,ROW($A$1:$A$79)),ROW(27:27)),6)),\"\",INDEX($A$1:$G$79,SMALL(IF($A$1:$A$79=$I$1,ROW($A$1:$A$79)),ROW(27:27)),6))","v":""},{"$f":"IF(ISERROR(INDEX($A$1:$H$79,SMALL(IF($A$1:$A$79=$I$1,ROW($A$1:$A$79)),ROW(27:27)),8)),\"\",INDEX($A$1:$H$79,SMALL(IF($A$1:$A$79=$I$1,ROW($A$1:$A$79)),ROW(27:27)),8))","v":""},{"$f":"IF(ISERROR(INDEX($A$1:$G$79,SMALL(IF($B$1:$B$79=$N$1,ROW($B$1:$B$79)),ROW(27:27)),6)),\"\",INDEX($A$1:$G$79,SMALL(IF($B$1:$B$79=$N$1,ROW($B$1:$B$79)),ROW(27:27)),6))","v":""},{"$f":"IF(ISERROR(INDEX($A$1:$G$79,SMALL(IF($B$1:$B$79=$N$1,ROW($B$1:$B$79)),ROW(27:27)),4)),\"\",INDEX($A$1:$G$79,SMALL(IF($B$1:$B$79=$N$1,ROW($B$1:$B$79)),ROW(27:27)),4))","v":""},{"$f":"IF(ISERROR(INDEX($A$1:$G$79,SMALL(IF($B$1:$B$79=$N$1,ROW($B$1:$B$79)),ROW(27:27)),5)),\"\",INDEX($A$1:$G$79,SMALL(IF($B$1:$B$79=$N$1,ROW($B$1:$B$79)),ROW(27:27)),5))","v":""},{"$f":"IF(ISERROR(INDEX($A$1:$G$79,SMALL(IF($B$1:$B$79=$N$1,ROW($B$1:$B$79)),ROW(27:27)),7)),\"\",INDEX($A$1:$G$79,SMALL(IF($B$1:$B$79=$N$1,ROW($B$1:$B$79)),ROW(27:27)),7))","v":""},{"$f":"IF(ISERROR(INDEX($A$1:$H$79,SMALL(IF($B$1:$B$79=$N$1,ROW($B$1:$B$79)),ROW(27:27)),8)),\"\",INDEX($A$1:$H$79,SMALL(IF($B$1:$B$79=$N$1,ROW($B$1:$B$79)),ROW(27:27)),8))","v":""},{"$f":"IF(ISERROR(INDEX($A$1:$G$79,SMALL(IF($C$1:$C$79=$S$1,ROW($C$1:$C$79)),ROW(27:27)),6)),\"\",INDEX($A$1:$G$79,SMALL(IF($C$1:$C$79=$S$1,ROW($C$1:$C$79)),ROW(27:27)),6))","v":""},{"$f":"IF(ISERROR(INDEX($A$1:$G$79,SMALL(IF($C$1:$C$79=$S$1,ROW($C$1:$C$79)),ROW(27:27)),4)),\"\",INDEX($A$1:$G$79,SMALL(IF($C$1:$C$79=$S$1,ROW($C$1:$C$79)),ROW(27:27)),4))","v":""},{"$f":"IF(ISERROR(INDEX($A$1:$G$79,SMALL(IF($C$1:$C$79=$S$1,ROW($C$1:$C$79)),ROW(27:27)),5)),\"\",INDEX($A$1:$G$79,SMALL(IF($C$1:$C$79=$S$1,ROW($C$1:$C$79)),ROW(27:27)),5))","v":""},{"$f":"IF(ISERROR(INDEX($A$1:$G$79,SMALL(IF($C$1:$C$79=$S$1,ROW($C$1:$C$79)),ROW(27:27)),7)),\"\",INDEX($A$1:$G$79,SMALL(IF($C$1:$C$79=$S$1,ROW($C$1:$C$79)),ROW(27:27)),7))","v":""},{"$f":"IF(ISERROR(INDEX($A$1:$H$79,SMALL(IF($C$1:$C$79=$S$1,ROW($C$1:$C$79)),ROW(27:27)),8)),\"\",INDEX($A$1:$H$79,SMALL(IF($C$1:$C$79=$S$1,ROW($C$1:$C$79)),ROW(27:27)),8))","v":""}," "]
[{"$f":"'Services & Housing'!F16","v":0},{"$f":"'Services & Housing'!G16","v":0},{"$f":"'Services & Housing'!H16","v":0},{"$f":"'Services & Housing'!B16","v":0},{"$f":"'Services & Housing'!C16","v":0},{"$f":"'Services & Housing'!D16","v":"Optional notes here"},"Services",0,{"$f":"IF(ISERROR(INDEX($A$1:$G$79,SMALL(IF($A$1:$A$79=$I$1,ROW($A$1:$A$79)),ROW(28:28)),7)),\"\",INDEX($A$1:$G$79,SMALL(IF($A$1:$A$79=$I$1,ROW($A$1:$A$79)),ROW(28:28)),7))","v":""},{"$f":"IF(ISERROR(INDEX($A$1:$G$79,SMALL(IF($A$1:$A$79=$I$1,ROW($A$1:$A$79)),ROW(28:28)),4)),\"\",INDEX($A$1:$G$79,SMALL(IF($A$1:$A$79=$I$1,ROW($A$1:$A$79)),ROW(28:28)),4))","v":""},{"$f":"IF(ISERROR(INDEX($A$1:$G$79,SMALL(IF($A$1:$A$79=$I$1,ROW($A$1:$A$79)),ROW(28:28)),5)),\"\",INDEX($A$1:$G$79,SMALL(IF($A$1:$A$79=$I$1,ROW($A$1:$A$79)),ROW(28:28)),5))","v":""},{"$f":"IF(ISERROR(INDEX($A$1:$G$79,SMALL(IF($A$1:$A$79=$I$1,ROW($A$1:$A$79)),ROW(28:28)),6)),\"\",INDEX($A$1:$G$79,SMALL(IF($A$1:$A$79=$I$1,ROW($A$1:$A$79)),ROW(28:28)),6))","v":""},{"$f":"IF(ISERROR(INDEX($A$1:$H$79,SMALL(IF($A$1:$A$79=$I$1,ROW($A$1:$A$79)),ROW(28:28)),8)),\"\",INDEX($A$1:$H$79,SMALL(IF($A$1:$A$79=$I$1,ROW($A$1:$A$79)),ROW(28:28)),8))","v":""},{"$f":"IF(ISERROR(INDEX($A$1:$G$79,SMALL(IF($B$1:$B$79=$N$1,ROW($B$1:$B$79)),ROW(28:28)),6)),\"\",INDEX($A$1:$G$79,SMALL(IF($B$1:$B$79=$N$1,ROW($B$1:$B$79)),ROW(28:28)),6))","v":""},{"$f":"IF(ISERROR(INDEX($A$1:$G$79,SMALL(IF($B$1:$B$79=$N$1,ROW($B$1:$B$79)),ROW(28:28)),4)),\"\",INDEX($A$1:$G$79,SMALL(IF($B$1:$B$79=$N$1,ROW($B$1:$B$79)),ROW(28:28)),4))","v":""},{"$f":"IF(ISERROR(INDEX($A$1:$G$79,SMALL(IF($B$1:$B$79=$N$1,ROW($B$1:$B$79)),ROW(28:28)),5)),\"\",INDEX($A$1:$G$79,SMALL(IF($B$1:$B$79=$N$1,ROW($B$1:$B$79)),ROW(28:28)),5))","v":""},{"$f":"IF(ISERROR(INDEX($A$1:$G$79,SMALL(IF($B$1:$B$79=$N$1,ROW($B$1:$B$79)),ROW(28:28)),7)),\"\",INDEX($A$1:$G$79,SMALL(IF($B$1:$B$79=$N$1,ROW($B$1:$B$79)),ROW(28:28)),7))","v":""},{"$f":"IF(ISERROR(INDEX($A$1:$H$79,SMALL(IF($B$1:$B$79=$N$1,ROW($B$1:$B$79)),ROW(28:28)),8)),\"\",INDEX($A$1:$H$79,SMALL(IF($B$1:$B$79=$N$1,ROW($B$1:$B$79)),ROW(28:28)),8))","v":""},{"$f":"IF(ISERROR(INDEX($A$1:$G$79,SMALL(IF($C$1:$C$79=$S$1,ROW($C$1:$C$79)),ROW(28:28)),6)),\"\",INDEX($A$1:$G$79,SMALL(IF($C$1:$C$79=$S$1,ROW($C$1:$C$79)),ROW(28:28)),6))","v":""},{"$f":"IF(ISERROR(INDEX($A$1:$G$79,SMALL(IF($C$1:$C$79=$S$1,ROW($C$1:$C$79)),ROW(28:28)),4)),\"\",INDEX($A$1:$G$79,SMALL(IF($C$1:$C$79=$S$1,ROW($C$1:$C$79)),ROW(28:28)),4))","v":""},{"$f":"IF(ISERROR(INDEX($A$1:$G$79,SMALL(IF($C$1:$C$79=$S$1,ROW($C$1:$C$79)),ROW(28:28)),5)),\"\",INDEX($A$1:$G$79,SMALL(IF($C$1:$C$79=$S$1,ROW($C$1:$C$79)),ROW(28:28)),5))","v":""},{"$f":"IF(ISERROR(INDEX($A$1:$G$79,SMALL(IF($C$1:$C$79=$S$1,ROW($C$1:$C$79)),ROW(28:28)),7)),\"\",INDEX($A$1:$G$79,SMALL(IF($C$1:$C$79=$S$1,ROW($C$1:$C$79)),ROW(28:28)),7))","v":""},{"$f":"IF(ISERROR(INDEX($A$1:$H$79,SMALL(IF($C$1:$C$79=$S$1,ROW($C$1:$C$79)),ROW(28:28)),8)),\"\",INDEX($A$1:$H$79,SMALL(IF($C$1:$C$79=$S$1,ROW($C$1:$C$79)),ROW(28:28)),8))","v":""}," "]
[{"$f":"'Services & Housing'!F17","v":"Please select answer"},{"$f":"'Services & Housing'!G17","v":"Please select answer"},{"$f":"'Services & Housing'!H17","v":"Please select answer"},{"$f":"'Services & Housing'!B17","v":6},{"$f":"'Services & Housing'!C17","v":"Services are culturally appropriate with translation services available, as needed"},{"$f":"'Services & Housing'!D17","v":"Project staff are sensitive to and support the cultural aspects of diverse households. Wherever possible, staff demographics reflect the participant population they serve in order to provide appropriate, culturally-specific services. Translation services are provided when needed to ensure full comprehension of the project. Projects that serve families with children should have family-friendly rules that allow for different schedules based on work and school hours and have services that allow parents to participate in activities without having to constantly supervise their children themselves (i.e. can use the bathroom or take a shower without their children being in the bathroom with them)."},"Services",{"$f":"F31","v":"Optional notes here"},{"$f":"IF(ISERROR(INDEX($A$1:$G$79,SMALL(IF($A$1:$A$79=$I$1,ROW($A$1:$A$79)),ROW(29:29)),7)),\"\",INDEX($A$1:$G$79,SMALL(IF($A$1:$A$79=$I$1,ROW($A$1:$A$79)),ROW(29:29)),7))","v":""},{"$f":"IF(ISERROR(INDEX($A$1:$G$79,SMALL(IF($A$1:$A$79=$I$1,ROW($A$1:$A$79)),ROW(29:29)),4)),\"\",INDEX($A$1:$G$79,SMALL(IF($A$1:$A$79=$I$1,ROW($A$1:$A$79)),ROW(29:29)),4))","v":""},{"$f":"IF(ISERROR(INDEX($A$1:$G$79,SMALL(IF($A$1:$A$79=$I$1,ROW($A$1:$A$79)),ROW(29:29)),5)),\"\",INDEX($A$1:$G$79,SMALL(IF($A$1:$A$79=$I$1,ROW($A$1:$A$79)),ROW(29:29)),5))","v":""},{"$f":"IF(ISERROR(INDEX($A$1:$G$79,SMALL(IF($A$1:$A$79=$I$1,ROW($A$1:$A$79)),ROW(29:29)),6)),\"\",INDEX($A$1:$G$79,SMALL(IF($A$1:$A$79=$I$1,ROW($A$1:$A$79)),ROW(29:29)),6))","v":""},{"$f":"IF(ISERROR(INDEX($A$1:$H$79,SMALL(IF($A$1:$A$79=$I$1,ROW($A$1:$A$79)),ROW(29:29)),8)),\"\",INDEX($A$1:$H$79,SMALL(IF($A$1:$A$79=$I$1,ROW($A$1:$A$79)),ROW(29:29)),8))","v":""},{"$f":"IF(ISERROR(INDEX($A$1:$G$79,SMALL(IF($B$1:$B$79=$N$1,ROW($B$1:$B$79)),ROW(29:29)),6)),\"\",INDEX($A$1:$G$79,SMALL(IF($B$1:$B$79=$N$1,ROW($B$1:$B$79)),ROW(29:29)),6))","v":""},{"$f":"IF(ISERROR(INDEX($A$1:$G$79,SMALL(IF($B$1:$B$79=$N$1,ROW($B$1:$B$79)),ROW(29:29)),4)),\"\",INDEX($A$1:$G$79,SMALL(IF($B$1:$B$79=$N$1,ROW($B$1:$B$79)),ROW(29:29)),4))","v":""},{"$f":"IF(ISERROR(INDEX($A$1:$G$79,SMALL(IF($B$1:$B$79=$N$1,ROW($B$1:$B$79)),ROW(29:29)),5)),\"\",INDEX($A$1:$G$79,SMALL(IF($B$1:$B$79=$N$1,ROW($B$1:$B$79)),ROW(29:29)),5))","v":""},{"$f":"IF(ISERROR(INDEX($A$1:$G$79,SMALL(IF($B$1:$B$79=$N$1,ROW($B$1:$B$79)),ROW(29:29)),7)),\"\",INDEX($A$1:$G$79,SMALL(IF($B$1:$B$79=$N$1,ROW($B$1:$B$79)),ROW(29:29)),7))","v":""},{"$f":"IF(ISERROR(INDEX($A$1:$H$79,SMALL(IF($B$1:$B$79=$N$1,ROW($B$1:$B$79)),ROW(29:29)),8)),\"\",INDEX($A$1:$H$79,SMALL(IF($B$1:$B$79=$N$1,ROW($B$1:$B$79)),ROW(29:29)),8))","v":""},{"$f":"IF(ISERROR(INDEX($A$1:$G$79,SMALL(IF($C$1:$C$79=$S$1,ROW($C$1:$C$79)),ROW(29:29)),6)),\"\",INDEX($A$1:$G$79,SMALL(IF($C$1:$C$79=$S$1,ROW($C$1:$C$79)),ROW(29:29)),6))","v":""},{"$f":"IF(ISERROR(INDEX($A$1:$G$79,SMALL(IF($C$1:$C$79=$S$1,ROW($C$1:$C$79)),ROW(29:29)),4)),\"\",INDEX($A$1:$G$79,SMALL(IF($C$1:$C$79=$S$1,ROW($C$1:$C$79)),ROW(29:29)),4))","v":""},{"$f":"IF(ISERROR(INDEX($A$1:$G$79,SMALL(IF($C$1:$C$79=$S$1,ROW($C$1:$C$79)),ROW(29:29)),5)),\"\",INDEX($A$1:$G$79,SMALL(IF($C$1:$C$79=$S$1,ROW($C$1:$C$79)),ROW(29:29)),5))","v":""},{"$f":"IF(ISERROR(INDEX($A$1:$G$79,SMALL(IF($C$1:$C$79=$S$1,ROW($C$1:$C$79)),ROW(29:29)),7)),\"\",INDEX($A$1:$G$79,SMALL(IF($C$1:$C$79=$S$1,ROW($C$1:$C$79)),ROW(29:29)),7))","v":""},{"$f":"IF(ISERROR(INDEX($A$1:$H$79,SMALL(IF($C$1:$C$79=$S$1,ROW($C$1:$C$79)),ROW(29:29)),8)),\"\",INDEX($A$1:$H$79,SMALL(IF($C$1:$C$79=$S$1,ROW($C$1:$C$79)),ROW(29:29)),8))","v":""}," "]
[{"$f":"'Services & Housing'!F18","v":0},{"$f":"'Services & Housing'!G18","v":0},{"$f":"'Services & Housing'!H18","v":0},{"$f":"'Services & Housing'!B18","v":0},{"$f":"'Services & Housing'!C18","v":0},{"$f":"'Services & Housing'!D18","v":"Optional notes here"},"Services",0,{"$f":"IF(ISERROR(INDEX($A$1:$G$79,SMALL(IF($A$1:$A$79=$I$1,ROW($A$1:$A$79)),ROW(30:30)),7)),\"\",INDEX($A$1:$G$79,SMALL(IF($A$1:$A$79=$I$1,ROW($A$1:$A$79)),ROW(30:30)),7))","v":""},{"$f":"IF(ISERROR(INDEX($A$1:$G$79,SMALL(IF($A$1:$A$79=$I$1,ROW($A$1:$A$79)),ROW(30:30)),4)),\"\",INDEX($A$1:$G$79,SMALL(IF($A$1:$A$79=$I$1,ROW($A$1:$A$79)),ROW(30:30)),4))","v":""},{"$f":"IF(ISERROR(INDEX($A$1:$G$79,SMALL(IF($A$1:$A$79=$I$1,ROW($A$1:$A$79)),ROW(30:30)),5)),\"\",INDEX($A$1:$G$79,SMALL(IF($A$1:$A$79=$I$1,ROW($A$1:$A$79)),ROW(30:30)),5))","v":""},{"$f":"IF(ISERROR(INDEX($A$1:$G$79,SMALL(IF($A$1:$A$79=$I$1,ROW($A$1:$A$79)),ROW(30:30)),6)),\"\",INDEX($A$1:$G$79,SMALL(IF($A$1:$A$79=$I$1,ROW($A$1:$A$79)),ROW(30:30)),6))","v":""},{"$f":"IF(ISERROR(INDEX($A$1:$H$79,SMALL(IF($A$1:$A$79=$I$1,ROW($A$1:$A$79)),ROW(30:30)),8)),\"\",INDEX($A$1:$H$79,SMALL(IF($A$1:$A$79=$I$1,ROW($A$1:$A$79)),ROW(30:30)),8))","v":""},{"$f":"IF(ISERROR(INDEX($A$1:$G$79,SMALL(IF($B$1:$B$79=$N$1,ROW($B$1:$B$79)),ROW(30:30)),6)),\"\",INDEX($A$1:$G$79,SMALL(IF($B$1:$B$79=$N$1,ROW($B$1:$B$79)),ROW(30:30)),6))","v":""},{"$f":"IF(ISERROR(INDEX($A$1:$G$79,SMALL(IF($B$1:$B$79=$N$1,ROW($B$1:$B$79)),ROW(30:30)),4)),\"\",INDEX($A$1:$G$79,SMALL(IF($B$1:$B$79=$N$1,ROW($B$1:$B$79)),ROW(30:30)),4))","v":""},{"$f":"IF(ISERROR(INDEX($A$1:$G$79,SMALL(IF($B$1:$B$79=$N$1,ROW($B$1:$B$79)),ROW(30:30)),5)),\"\",INDEX($A$1:$G$79,SMALL(IF($B$1:$B$79=$N$1,ROW($B$1:$B$79)),ROW(30:30)),5))","v":""},{"$f":"IF(ISERROR(INDEX($A$1:$G$79,SMALL(IF($B$1:$B$79=$N$1,ROW($B$1:$B$79)),ROW(30:30)),7)),\"\",INDEX($A$1:$G$79,SMALL(IF($B$1:$B$79=$N$1,ROW($B$1:$B$79)),ROW(30:30)),7))","v":""},{"$f":"IF(ISERROR(INDEX($A$1:$H$79,SMALL(IF($B$1:$B$79=$N$1,ROW($B$1:$B$79)),ROW(30:30)),8)),\"\",INDEX($A$1:$H$79,SMALL(IF($B$1:$B$79=$N$1,ROW($B$1:$B$79)),ROW(30:30)),8))","v":""},{"$f":"IF(ISERROR(INDEX($A$1:$G$79,SMALL(IF($C$1:$C$79=$S$1,ROW($C$1:$C$79)),ROW(30:30)),6)),\"\",INDEX($A$1:$G$79,SMALL(IF($C$1:$C$79=$S$1,ROW($C$1:$C$79)),ROW(30:30)),6))","v":""},{"$f":"IF(ISERROR(INDEX($A$1:$G$79,SMALL(IF($C$1:$C$79=$S$1,ROW($C$1:$C$79)),ROW(30:30)),4)),\"\",INDEX($A$1:$G$79,SMALL(IF($C$1:$C$79=$S$1,ROW($C$1:$C$79)),ROW(30:30)),4))","v":""},{"$f":"IF(ISERROR(INDEX($A$1:$G$79,SMALL(IF($C$1:$C$79=$S$1,ROW($C$1:$C$79)),ROW(30:30)),5)),\"\",INDEX($A$1:$G$79,SMALL(IF($C$1:$C$79=$S$1,ROW($C$1:$C$79)),ROW(30:30)),5))","v":""},{"$f":"IF(ISERROR(INDEX($A$1:$G$79,SMALL(IF($C$1:$C$79=$S$1,ROW($C$1:$C$79)),ROW(30:30)),7)),\"\",INDEX($A$1:$G$79,SMALL(IF($C$1:$C$79=$S$1,ROW($C$1:$C$79)),ROW(30:30)),7))","v":""},{"$f":"IF(ISERROR(INDEX($A$1:$H$79,SMALL(IF($C$1:$C$79=$S$1,ROW($C$1:$C$79)),ROW(30:30)),8)),\"\",INDEX($A$1:$H$79,SMALL(IF($C$1:$C$79=$S$1,ROW($C$1:$C$79)),ROW(30:30)),8))","v":""}," "]
[{"$f":"'Services & Housing'!F19","v":"Please select answer"},{"$f":"'Services & Housing'!G19","v":"Please select answer"},{"$f":"'Services & Housing'!H19","v":"Please select answer"},{"$f":"'Services & Housing'!B19","v":7},{"$f":"'Services & Housing'!C19","v":"Staff are trained in clinical and non-clinical strategies (including harm reduction, motivational interviewing, trauma-informed approaches, strength-based)"},{"$f":"'Services & Housing'!D19","v":"Services support a participant’s ability to obtain and retain housing regardless of changes in behavior.  Services are informed by a harm-reduction philosophy, such as recognizing that substance use and addiction are a part of some participants' lives. Participants are engaged in non-judgmental communication regarding their behavior and are offered education regarding how to avoid risky behaviors and engage in safer practices."},"Services",{"$f":"F33","v":"Optional notes here"},{"$f":"IF(ISERROR(INDEX($A$1:$G$79,SMALL(IF($A$1:$A$79=$I$1,ROW($A$1:$A$79)),ROW(31:31)),7)),\"\",INDEX($A$1:$G$79,SMALL(IF($A$1:$A$79=$I$1,ROW($A$1:$A$79)),ROW(31:31)),7))","v":""},{"$f":"IF(ISERROR(INDEX($A$1:$G$79,SMALL(IF($A$1:$A$79=$I$1,ROW($A$1:$A$79)),ROW(31:31)),4)),\"\",INDEX($A$1:$G$79,SMALL(IF($A$1:$A$79=$I$1,ROW($A$1:$A$79)),ROW(31:31)),4))","v":""},{"$f":"IF(ISERROR(INDEX($A$1:$G$79,SMALL(IF($A$1:$A$79=$I$1,ROW($A$1:$A$79)),ROW(31:31)),5)),\"\",INDEX($A$1:$G$79,SMALL(IF($A$1:$A$79=$I$1,ROW($A$1:$A$79)),ROW(31:31)),5))","v":""},{"$f":"IF(ISERROR(INDEX($A$1:$G$79,SMALL(IF($A$1:$A$79=$I$1,ROW($A$1:$A$79)),ROW(31:31)),6)),\"\",INDEX($A$1:$G$79,SMALL(IF($A$1:$A$79=$I$1,ROW($A$1:$A$79)),ROW(31:31)),6))","v":""},{"$f":"IF(ISERROR(INDEX($A$1:$H$79,SMALL(IF($A$1:$A$79=$I$1,ROW($A$1:$A$79)),ROW(31:31)),8)),\"\",INDEX($A$1:$H$79,SMALL(IF($A$1:$A$79=$I$1,ROW($A$1:$A$79)),ROW(31:31)),8))","v":""},{"$f":"IF(ISERROR(INDEX($A$1:$G$79,SMALL(IF($B$1:$B$79=$N$1,ROW($B$1:$B$79)),ROW(31:31)),6)),\"\",INDEX($A$1:$G$79,SMALL(IF($B$1:$B$79=$N$1,ROW($B$1:$B$79)),ROW(31:31)),6))","v":""},{"$f":"IF(ISERROR(INDEX($A$1:$G$79,SMALL(IF($B$1:$B$79=$N$1,ROW($B$1:$B$79)),ROW(31:31)),4)),\"\",INDEX($A$1:$G$79,SMALL(IF($B$1:$B$79=$N$1,ROW($B$1:$B$79)),ROW(31:31)),4))","v":""},{"$f":"IF(ISERROR(INDEX($A$1:$G$79,SMALL(IF($B$1:$B$79=$N$1,ROW($B$1:$B$79)),ROW(31:31)),5)),\"\",INDEX($A$1:$G$79,SMALL(IF($B$1:$B$79=$N$1,ROW($B$1:$B$79)),ROW(31:31)),5))","v":""},{"$f":"IF(ISERROR(INDEX($A$1:$G$79,SMALL(IF($B$1:$B$79=$N$1,ROW($B$1:$B$79)),ROW(31:31)),7)),\"\",INDEX($A$1:$G$79,SMALL(IF($B$1:$B$79=$N$1,ROW($B$1:$B$79)),ROW(31:31)),7))","v":""},{"$f":"IF(ISERROR(INDEX($A$1:$H$79,SMALL(IF($B$1:$B$79=$N$1,ROW($B$1:$B$79)),ROW(31:31)),8)),\"\",INDEX($A$1:$H$79,SMALL(IF($B$1:$B$79=$N$1,ROW($B$1:$B$79)),ROW(31:31)),8))","v":""},{"$f":"IF(ISERROR(INDEX($A$1:$G$79,SMALL(IF($C$1:$C$79=$S$1,ROW($C$1:$C$79)),ROW(31:31)),6)),\"\",INDEX($A$1:$G$79,SMALL(IF($C$1:$C$79=$S$1,ROW($C$1:$C$79)),ROW(31:31)),6))","v":""},{"$f":"IF(ISERROR(INDEX($A$1:$G$79,SMALL(IF($C$1:$C$79=$S$1,ROW($C$1:$C$79)),ROW(31:31)),4)),\"\",INDEX($A$1:$G$79,SMALL(IF($C$1:$C$79=$S$1,ROW($C$1:$C$79)),ROW(31:31)),4))","v":""},{"$f":"IF(ISERROR(INDEX($A$1:$G$79,SMALL(IF($C$1:$C$79=$S$1,ROW($C$1:$C$79)),ROW(31:31)),5)),\"\",INDEX($A$1:$G$79,SMALL(IF($C$1:$C$79=$S$1,ROW($C$1:$C$79)),ROW(31:31)),5))","v":""},{"$f":"IF(ISERROR(INDEX($A$1:$G$79,SMALL(IF($C$1:$C$79=$S$1,ROW($C$1:$C$79)),ROW(31:31)),7)),\"\",INDEX($A$1:$G$79,SMALL(IF($C$1:$C$79=$S$1,ROW($C$1:$C$79)),ROW(31:31)),7))","v":""},{"$f":"IF(ISERROR(INDEX($A$1:$H$79,SMALL(IF($C$1:$C$79=$S$1,ROW($C$1:$C$79)),ROW(31:31)),8)),\"\",INDEX($A$1:$H$79,SMALL(IF($C$1:$C$79=$S$1,ROW($C$1:$C$79)),ROW(31:31)),8))","v":""}," "]
[{"$f":"'Services & Housing'!F20","v":0},{"$f":"'Services & Housing'!G20","v":0},{"$f":"'Services & Housing'!H20","v":0},{"$f":"'Services & Housing'!B20","v":0},{"$f":"'Services & Housing'!C20","v":0},{"$f":"'Services & Housing'!D20","v":"Optional notes here"},"Services",0,{"$f":"IF(ISERROR(INDEX($A$1:$G$79,SMALL(IF($A$1:$A$79=$I$1,ROW($A$1:$A$79)),ROW(32:32)),7)),\"\",INDEX($A$1:$G$79,SMALL(IF($A$1:$A$79=$I$1,ROW($A$1:$A$79)),ROW(32:32)),7))","v":""},{"$f":"IF(ISERROR(INDEX($A$1:$G$79,SMALL(IF($A$1:$A$79=$I$1,ROW($A$1:$A$79)),ROW(32:32)),4)),\"\",INDEX($A$1:$G$79,SMALL(IF($A$1:$A$79=$I$1,ROW($A$1:$A$79)),ROW(32:32)),4))","v":""},{"$f":"IF(ISERROR(INDEX($A$1:$G$79,SMALL(IF($A$1:$A$79=$I$1,ROW($A$1:$A$79)),ROW(32:32)),5)),\"\",INDEX($A$1:$G$79,SMALL(IF($A$1:$A$79=$I$1,ROW($A$1:$A$79)),ROW(32:32)),5))","v":""},{"$f":"IF(ISERROR(INDEX($A$1:$G$79,SMALL(IF($A$1:$A$79=$I$1,ROW($A$1:$A$79)),ROW(32:32)),6)),\"\",INDEX($A$1:$G$79,SMALL(IF($A$1:$A$79=$I$1,ROW($A$1:$A$79)),ROW(32:32)),6))","v":""},{"$f":"IF(ISERROR(INDEX($A$1:$H$79,SMALL(IF($A$1:$A$79=$I$1,ROW($A$1:$A$79)),ROW(32:32)),8)),\"\",INDEX($A$1:$H$79,SMALL(IF($A$1:$A$79=$I$1,ROW($A$1:$A$79)),ROW(32:32)),8))","v":""},{"$f":"IF(ISERROR(INDEX($A$1:$G$79,SMALL(IF($B$1:$B$79=$N$1,ROW($B$1:$B$79)),ROW(32:32)),6)),\"\",INDEX($A$1:$G$79,SMALL(IF($B$1:$B$79=$N$1,ROW($B$1:$B$79)),ROW(32:32)),6))","v":""},{"$f":"IF(ISERROR(INDEX($A$1:$G$79,SMALL(IF($B$1:$B$79=$N$1,ROW($B$1:$B$79)),ROW(32:32)),4)),\"\",INDEX($A$1:$G$79,SMALL(IF($B$1:$B$79=$N$1,ROW($B$1:$B$79)),ROW(32:32)),4))","v":""},{"$f":"IF(ISERROR(INDEX($A$1:$G$79,SMALL(IF($B$1:$B$79=$N$1,ROW($B$1:$B$79)),ROW(32:32)),5)),\"\",INDEX($A$1:$G$79,SMALL(IF($B$1:$B$79=$N$1,ROW($B$1:$B$79)),ROW(32:32)),5))","v":""},{"$f":"IF(ISERROR(INDEX($A$1:$G$79,SMALL(IF($B$1:$B$79=$N$1,ROW($B$1:$B$79)),ROW(32:32)),7)),\"\",INDEX($A$1:$G$79,SMALL(IF($B$1:$B$79=$N$1,ROW($B$1:$B$79)),ROW(32:32)),7))","v":""},{"$f":"IF(ISERROR(INDEX($A$1:$H$79,SMALL(IF($B$1:$B$79=$N$1,ROW($B$1:$B$79)),ROW(32:32)),8)),\"\",INDEX($A$1:$H$79,SMALL(IF($B$1:$B$79=$N$1,ROW($B$1:$B$79)),ROW(32:32)),8))","v":""},{"$f":"IF(ISERROR(INDEX($A$1:$G$79,SMALL(IF($C$1:$C$79=$S$1,ROW($C$1:$C$79)),ROW(32:32)),6)),\"\",INDEX($A$1:$G$79,SMALL(IF($C$1:$C$79=$S$1,ROW($C$1:$C$79)),ROW(32:32)),6))","v":""},{"$f":"IF(ISERROR(INDEX($A$1:$G$79,SMALL(IF($C$1:$C$79=$S$1,ROW($C$1:$C$79)),ROW(32:32)),4)),\"\",INDEX($A$1:$G$79,SMALL(IF($C$1:$C$79=$S$1,ROW($C$1:$C$79)),ROW(32:32)),4))","v":""},{"$f":"IF(ISERROR(INDEX($A$1:$G$79,SMALL(IF($C$1:$C$79=$S$1,ROW($C$1:$C$79)),ROW(32:32)),5)),\"\",INDEX($A$1:$G$79,SMALL(IF($C$1:$C$79=$S$1,ROW($C$1:$C$79)),ROW(32:32)),5))","v":""},{"$f":"IF(ISERROR(INDEX($A$1:$G$79,SMALL(IF($C$1:$C$79=$S$1,ROW($C$1:$C$79)),ROW(32:32)),7)),\"\",INDEX($A$1:$G$79,SMALL(IF($C$1:$C$79=$S$1,ROW($C$1:$C$79)),ROW(32:32)),7))","v":""},{"$f":"IF(ISERROR(INDEX($A$1:$H$79,SMALL(IF($C$1:$C$79=$S$1,ROW($C$1:$C$79)),ROW(32:32)),8)),\"\",INDEX($A$1:$H$79,SMALL(IF($C$1:$C$79=$S$1,ROW($C$1:$C$79)),ROW(32:32)),8))","v":""}," "]
[{"$f":"'Services & Housing'!F22","v":"Please select answer"},{"$f":"'Services & Housing'!G22","v":"Please select answer"},{"$f":"'Services & Housing'!H22","v":"Please select answer"},{"$f":"'Services & Housing'!B22","v":1},{"$f":"'Services & Housing'!C22","v":"Housing is not dependent on participation in services"},{"$f":"'Services & Housing'!D22","v":"Participation in permanent and temporary housing settings,  as well as crisis settings such as emergency shelter, is not contingent on participating in supportive services or demonstration of progress made on a service plan.  Services must be offered by staff, but are voluntary for participants. "},"Housing",{"$f":"F35","v":"Optional notes here"},{"$f":"IF(ISERROR(INDEX($A$1:$G$79,SMALL(IF($A$1:$A$79=$I$1,ROW($A$1:$A$79)),ROW(33:33)),7)),\"\",INDEX($A$1:$G$79,SMALL(IF($A$1:$A$79=$I$1,ROW($A$1:$A$79)),ROW(33:33)),7))","v":""},{"$f":"IF(ISERROR(INDEX($A$1:$G$79,SMALL(IF($A$1:$A$79=$I$1,ROW($A$1:$A$79)),ROW(33:33)),4)),\"\",INDEX($A$1:$G$79,SMALL(IF($A$1:$A$79=$I$1,ROW($A$1:$A$79)),ROW(33:33)),4))","v":""},{"$f":"IF(ISERROR(INDEX($A$1:$G$79,SMALL(IF($A$1:$A$79=$I$1,ROW($A$1:$A$79)),ROW(33:33)),5)),\"\",INDEX($A$1:$G$79,SMALL(IF($A$1:$A$79=$I$1,ROW($A$1:$A$79)),ROW(33:33)),5))","v":""},{"$f":"IF(ISERROR(INDEX($A$1:$G$79,SMALL(IF($A$1:$A$79=$I$1,ROW($A$1:$A$79)),ROW(33:33)),6)),\"\",INDEX($A$1:$G$79,SMALL(IF($A$1:$A$79=$I$1,ROW($A$1:$A$79)),ROW(33:33)),6))","v":""},{"$f":"IF(ISERROR(INDEX($A$1:$H$79,SMALL(IF($A$1:$A$79=$I$1,ROW($A$1:$A$79)),ROW(33:33)),8)),\"\",INDEX($A$1:$H$79,SMALL(IF($A$1:$A$79=$I$1,ROW($A$1:$A$79)),ROW(33:33)),8))","v":""},{"$f":"IF(ISERROR(INDEX($A$1:$G$79,SMALL(IF($B$1:$B$79=$N$1,ROW($B$1:$B$79)),ROW(33:33)),6)),\"\",INDEX($A$1:$G$79,SMALL(IF($B$1:$B$79=$N$1,ROW($B$1:$B$79)),ROW(33:33)),6))","v":""},{"$f":"IF(ISERROR(INDEX($A$1:$G$79,SMALL(IF($B$1:$B$79=$N$1,ROW($B$1:$B$79)),ROW(33:33)),4)),\"\",INDEX($A$1:$G$79,SMALL(IF($B$1:$B$79=$N$1,ROW($B$1:$B$79)),ROW(33:33)),4))","v":""},{"$f":"IF(ISERROR(INDEX($A$1:$G$79,SMALL(IF($B$1:$B$79=$N$1,ROW($B$1:$B$79)),ROW(33:33)),5)),\"\",INDEX($A$1:$G$79,SMALL(IF($B$1:$B$79=$N$1,ROW($B$1:$B$79)),ROW(33:33)),5))","v":""},{"$f":"IF(ISERROR(INDEX($A$1:$G$79,SMALL(IF($B$1:$B$79=$N$1,ROW($B$1:$B$79)),ROW(33:33)),7)),\"\",INDEX($A$1:$G$79,SMALL(IF($B$1:$B$79=$N$1,ROW($B$1:$B$79)),ROW(33:33)),7))","v":""},{"$f":"IF(ISERROR(INDEX($A$1:$H$79,SMALL(IF($B$1:$B$79=$N$1,ROW($B$1:$B$79)),ROW(33:33)),8)),\"\",INDEX($A$1:$H$79,SMALL(IF($B$1:$B$79=$N$1,ROW($B$1:$B$79)),ROW(33:33)),8))","v":""},{"$f":"IF(ISERROR(INDEX($A$1:$G$79,SMALL(IF($C$1:$C$79=$S$1,ROW($C$1:$C$79)),ROW(33:33)),6)),\"\",INDEX($A$1:$G$79,SMALL(IF($C$1:$C$79=$S$1,ROW($C$1:$C$79)),ROW(33:33)),6))","v":""},{"$f":"IF(ISERROR(INDEX($A$1:$G$79,SMALL(IF($C$1:$C$79=$S$1,ROW($C$1:$C$79)),ROW(33:33)),4)),\"\",INDEX($A$1:$G$79,SMALL(IF($C$1:$C$79=$S$1,ROW($C$1:$C$79)),ROW(33:33)),4))","v":""},{"$f":"IF(ISERROR(INDEX($A$1:$G$79,SMALL(IF($C$1:$C$79=$S$1,ROW($C$1:$C$79)),ROW(33:33)),5)),\"\",INDEX($A$1:$G$79,SMALL(IF($C$1:$C$79=$S$1,ROW($C$1:$C$79)),ROW(33:33)),5))","v":""},{"$f":"IF(ISERROR(INDEX($A$1:$G$79,SMALL(IF($C$1:$C$79=$S$1,ROW($C$1:$C$79)),ROW(33:33)),7)),\"\",INDEX($A$1:$G$79,SMALL(IF($C$1:$C$79=$S$1,ROW($C$1:$C$79)),ROW(33:33)),7))","v":""},{"$f":"IF(ISERROR(INDEX($A$1:$H$79,SMALL(IF($C$1:$C$79=$S$1,ROW($C$1:$C$79)),ROW(33:33)),8)),\"\",INDEX($A$1:$H$79,SMALL(IF($C$1:$C$79=$S$1,ROW($C$1:$C$79)),ROW(33:33)),8))","v":""}," "]
[{"$f":"'Services & Housing'!F23","v":0},{"$f":"'Services & Housing'!G23","v":0},{"$f":"'Services & Housing'!H23","v":0},{"$f":"'Services & Housing'!B23","v":0},{"$f":"'Services & Housing'!C23","v":0},{"$f":"'Services & Housing'!D23","v":"Optional notes here"},"Housing",0,{"$f":"IF(ISERROR(INDEX($A$1:$G$79,SMALL(IF($A$1:$A$79=$I$1,ROW($A$1:$A$79)),ROW(34:34)),7)),\"\",INDEX($A$1:$G$79,SMALL(IF($A$1:$A$79=$I$1,ROW($A$1:$A$79)),ROW(34:34)),7))","v":""},{"$f":"IF(ISERROR(INDEX($A$1:$G$79,SMALL(IF($A$1:$A$79=$I$1,ROW($A$1:$A$79)),ROW(34:34)),4)),\"\",INDEX($A$1:$G$79,SMALL(IF($A$1:$A$79=$I$1,ROW($A$1:$A$79)),ROW(34:34)),4))","v":""},{"$f":"IF(ISERROR(INDEX($A$1:$G$79,SMALL(IF($A$1:$A$79=$I$1,ROW($A$1:$A$79)),ROW(34:34)),5)),\"\",INDEX($A$1:$G$79,SMALL(IF($A$1:$A$79=$I$1,ROW($A$1:$A$79)),ROW(34:34)),5))","v":""},{"$f":"IF(ISERROR(INDEX($A$1:$G$79,SMALL(IF($A$1:$A$79=$I$1,ROW($A$1:$A$79)),ROW(34:34)),6)),\"\",INDEX($A$1:$G$79,SMALL(IF($A$1:$A$79=$I$1,ROW($A$1:$A$79)),ROW(34:34)),6))","v":""},{"$f":"IF(ISERROR(INDEX($A$1:$H$79,SMALL(IF($A$1:$A$79=$I$1,ROW($A$1:$A$79)),ROW(34:34)),8)),\"\",INDEX($A$1:$H$79,SMALL(IF($A$1:$A$79=$I$1,ROW($A$1:$A$79)),ROW(34:34)),8))","v":""},{"$f":"IF(ISERROR(INDEX($A$1:$G$79,SMALL(IF($B$1:$B$79=$N$1,ROW($B$1:$B$79)),ROW(34:34)),6)),\"\",INDEX($A$1:$G$79,SMALL(IF($B$1:$B$79=$N$1,ROW($B$1:$B$79)),ROW(34:34)),6))","v":""},{"$f":"IF(ISERROR(INDEX($A$1:$G$79,SMALL(IF($B$1:$B$79=$N$1,ROW($B$1:$B$79)),ROW(34:34)),4)),\"\",INDEX($A$1:$G$79,SMALL(IF($B$1:$B$79=$N$1,ROW($B$1:$B$79)),ROW(34:34)),4))","v":""},{"$f":"IF(ISERROR(INDEX($A$1:$G$79,SMALL(IF($B$1:$B$79=$N$1,ROW($B$1:$B$79)),ROW(34:34)),5)),\"\",INDEX($A$1:$G$79,SMALL(IF($B$1:$B$79=$N$1,ROW($B$1:$B$79)),ROW(34:34)),5))","v":""},{"$f":"IF(ISERROR(INDEX($A$1:$G$79,SMALL(IF($B$1:$B$79=$N$1,ROW($B$1:$B$79)),ROW(34:34)),7)),\"\",INDEX($A$1:$G$79,SMALL(IF($B$1:$B$79=$N$1,ROW($B$1:$B$79)),ROW(34:34)),7))","v":""},{"$f":"IF(ISERROR(INDEX($A$1:$H$79,SMALL(IF($B$1:$B$79=$N$1,ROW($B$1:$B$79)),ROW(34:34)),8)),\"\",INDEX($A$1:$H$79,SMALL(IF($B$1:$B$79=$N$1,ROW($B$1:$B$79)),ROW(34:34)),8))","v":""},{"$f":"IF(ISERROR(INDEX($A$1:$G$79,SMALL(IF($C$1:$C$79=$S$1,ROW($C$1:$C$79)),ROW(34:34)),6)),\"\",INDEX($A$1:$G$79,SMALL(IF($C$1:$C$79=$S$1,ROW($C$1:$C$79)),ROW(34:34)),6))","v":""},{"$f":"IF(ISERROR(INDEX($A$1:$G$79,SMALL(IF($C$1:$C$79=$S$1,ROW($C$1:$C$79)),ROW(34:34)),4)),\"\",INDEX($A$1:$G$79,SMALL(IF($C$1:$C$79=$S$1,ROW($C$1:$C$79)),ROW(34:34)),4))","v":""},{"$f":"IF(ISERROR(INDEX($A$1:$G$79,SMALL(IF($C$1:$C$79=$S$1,ROW($C$1:$C$79)),ROW(34:34)),5)),\"\",INDEX($A$1:$G$79,SMALL(IF($C$1:$C$79=$S$1,ROW($C$1:$C$79)),ROW(34:34)),5))","v":""},{"$f":"IF(ISERROR(INDEX($A$1:$G$79,SMALL(IF($C$1:$C$79=$S$1,ROW($C$1:$C$79)),ROW(34:34)),7)),\"\",INDEX($A$1:$G$79,SMALL(IF($C$1:$C$79=$S$1,ROW($C$1:$C$79)),ROW(34:34)),7))","v":""},{"$f":"IF(ISERROR(INDEX($A$1:$H$79,SMALL(IF($C$1:$C$79=$S$1,ROW($C$1:$C$79)),ROW(34:34)),8)),\"\",INDEX($A$1:$H$79,SMALL(IF($C$1:$C$79=$S$1,ROW($C$1:$C$79)),ROW(34:34)),8))","v":""}," "]
[{"$f":"'Services & Housing'!F24","v":"Please select answer"},{"$f":"'Services & Housing'!G24","v":"Please select answer"},{"$f":"'Services & Housing'!H24","v":"Please select answer"},{"$f":"'Services & Housing'!B24","v":2},{"$f":"'Services & Housing'!C24","v":"Substance use is not a reason for termination"},{"$f":"'Services & Housing'!D24","v":"Participants are only terminated from the project for violations in the lease or occupancy agreements, as applicable.  Occupancy agreements or an addendum to the lease do not include conditions around substance use or participation in services. If the project is a recovery housing model focused on people who are in early recovery from drugs or alcohol (as outlined in HUD’s Recovery Housing Brief), different standards related to use and subsequent offer of treatment may apply. See HUD's Recovery Housing brief here: https://www.hudexchange.info/resource/4852/recovery-housing-policy-brief/"},"Housing",{"$f":"F37","v":"Optional notes here"},{"$f":"IF(ISERROR(INDEX($A$1:$G$79,SMALL(IF($A$1:$A$79=$I$1,ROW($A$1:$A$79)),ROW(35:35)),7)),\"\",INDEX($A$1:$G$79,SMALL(IF($A$1:$A$79=$I$1,ROW($A$1:$A$79)),ROW(35:35)),7))","v":""},{"$f":"IF(ISERROR(INDEX($A$1:$G$79,SMALL(IF($A$1:$A$79=$I$1,ROW($A$1:$A$79)),ROW(35:35)),4)),\"\",INDEX($A$1:$G$79,SMALL(IF($A$1:$A$79=$I$1,ROW($A$1:$A$79)),ROW(35:35)),4))","v":""},{"$f":"IF(ISERROR(INDEX($A$1:$G$79,SMALL(IF($A$1:$A$79=$I$1,ROW($A$1:$A$79)),ROW(35:35)),5)),\"\",INDEX($A$1:$G$79,SMALL(IF($A$1:$A$79=$I$1,ROW($A$1:$A$79)),ROW(35:35)),5))","v":""},{"$f":"IF(ISERROR(INDEX($A$1:$G$79,SMALL(IF($A$1:$A$79=$I$1,ROW($A$1:$A$79)),ROW(35:35)),6)),\"\",INDEX($A$1:$G$79,SMALL(IF($A$1:$A$79=$I$1,ROW($A$1:$A$79)),ROW(35:35)),6))","v":""},{"$f":"IF(ISERROR(INDEX($A$1:$H$79,SMALL(IF($A$1:$A$79=$I$1,ROW($A$1:$A$79)),ROW(35:35)),8)),\"\",INDEX($A$1:$H$79,SMALL(IF($A$1:$A$79=$I$1,ROW($A$1:$A$79)),ROW(35:35)),8))","v":""},{"$f":"IF(ISERROR(INDEX($A$1:$G$79,SMALL(IF($B$1:$B$79=$N$1,ROW($B$1:$B$79)),ROW(35:35)),6)),\"\",INDEX($A$1:$G$79,SMALL(IF($B$1:$B$79=$N$1,ROW($B$1:$B$79)),ROW(35:35)),6))","v":""},{"$f":"IF(ISERROR(INDEX($A$1:$G$79,SMALL(IF($B$1:$B$79=$N$1,ROW($B$1:$B$79)),ROW(35:35)),4)),\"\",INDEX($A$1:$G$79,SMALL(IF($B$1:$B$79=$N$1,ROW($B$1:$B$79)),ROW(35:35)),4))","v":""},{"$f":"IF(ISERROR(INDEX($A$1:$G$79,SMALL(IF($B$1:$B$79=$N$1,ROW($B$1:$B$79)),ROW(35:35)),5)),\"\",INDEX($A$1:$G$79,SMALL(IF($B$1:$B$79=$N$1,ROW($B$1:$B$79)),ROW(35:35)),5))","v":""},{"$f":"IF(ISERROR(INDEX($A$1:$G$79,SMALL(IF($B$1:$B$79=$N$1,ROW($B$1:$B$79)),ROW(35:35)),7)),\"\",INDEX($A$1:$G$79,SMALL(IF($B$1:$B$79=$N$1,ROW($B$1:$B$79)),ROW(35:35)),7))","v":""},{"$f":"IF(ISERROR(INDEX($A$1:$H$79,SMALL(IF($B$1:$B$79=$N$1,ROW($B$1:$B$79)),ROW(35:35)),8)),\"\",INDEX($A$1:$H$79,SMALL(IF($B$1:$B$79=$N$1,ROW($B$1:$B$79)),ROW(35:35)),8))","v":""},{"$f":"IF(ISERROR(INDEX($A$1:$G$79,SMALL(IF($C$1:$C$79=$S$1,ROW($C$1:$C$79)),ROW(35:35)),6)),\"\",INDEX($A$1:$G$79,SMALL(IF($C$1:$C$79=$S$1,ROW($C$1:$C$79)),ROW(35:35)),6))","v":""},{"$f":"IF(ISERROR(INDEX($A$1:$G$79,SMALL(IF($C$1:$C$79=$S$1,ROW($C$1:$C$79)),ROW(35:35)),4)),\"\",INDEX($A$1:$G$79,SMALL(IF($C$1:$C$79=$S$1,ROW($C$1:$C$79)),ROW(35:35)),4))","v":""},{"$f":"IF(ISERROR(INDEX($A$1:$G$79,SMALL(IF($C$1:$C$79=$S$1,ROW($C$1:$C$79)),ROW(35:35)),5)),\"\",INDEX($A$1:$G$79,SMALL(IF($C$1:$C$79=$S$1,ROW($C$1:$C$79)),ROW(35:35)),5))","v":""},{"$f":"IF(ISERROR(INDEX($A$1:$G$79,SMALL(IF($C$1:$C$79=$S$1,ROW($C$1:$C$79)),ROW(35:35)),7)),\"\",INDEX($A$1:$G$79,SMALL(IF($C$1:$C$79=$S$1,ROW($C$1:$C$79)),ROW(35:35)),7))","v":""},{"$f":"IF(ISERROR(INDEX($A$1:$H$79,SMALL(IF($C$1:$C$79=$S$1,ROW($C$1:$C$79)),ROW(35:35)),8)),\"\",INDEX($A$1:$H$79,SMALL(IF($C$1:$C$79=$S$1,ROW($C$1:$C$79)),ROW(35:35)),8))","v":""}," "]
[{"$f":"'Services & Housing'!F25","v":0},{"$f":"'Services & Housing'!G25","v":0},{"$f":"'Services & Housing'!H25","v":0},{"$f":"'Services & Housing'!B25","v":0},{"$f":"'Services & Housing'!C25","v":0},{"$f":"'Services & Housing'!D25","v":"Optional notes here"},"Housing",0,{"$f":"IF(ISERROR(INDEX($A$1:$G$79,SMALL(IF($A$1:$A$79=$I$1,ROW($A$1:$A$79)),ROW(36:36)),7)),\"\",INDEX($A$1:$G$79,SMALL(IF($A$1:$A$79=$I$1,ROW($A$1:$A$79)),ROW(36:36)),7))","v":""},{"$f":"IF(ISERROR(INDEX($A$1:$G$79,SMALL(IF($A$1:$A$79=$I$1,ROW($A$1:$A$79)),ROW(36:36)),4)),\"\",INDEX($A$1:$G$79,SMALL(IF($A$1:$A$79=$I$1,ROW($A$1:$A$79)),ROW(36:36)),4))","v":""},{"$f":"IF(ISERROR(INDEX($A$1:$G$79,SMALL(IF($A$1:$A$79=$I$1,ROW($A$1:$A$79)),ROW(36:36)),5)),\"\",INDEX($A$1:$G$79,SMALL(IF($A$1:$A$79=$I$1,ROW($A$1:$A$79)),ROW(36:36)),5))","v":""},{"$f":"IF(ISERROR(INDEX($A$1:$G$79,SMALL(IF($A$1:$A$79=$I$1,ROW($A$1:$A$79)),ROW(36:36)),6)),\"\",INDEX($A$1:$G$79,SMALL(IF($A$1:$A$79=$I$1,ROW($A$1:$A$79)),ROW(36:36)),6))","v":""},{"$f":"IF(ISERROR(INDEX($A$1:$H$79,SMALL(IF($A$1:$A$79=$I$1,ROW($A$1:$A$79)),ROW(36:36)),8)),\"\",INDEX($A$1:$H$79,SMALL(IF($A$1:$A$79=$I$1,ROW($A$1:$A$79)),ROW(36:36)),8))","v":""},{"$f":"IF(ISERROR(INDEX($A$1:$G$79,SMALL(IF($B$1:$B$79=$N$1,ROW($B$1:$B$79)),ROW(36:36)),6)),\"\",INDEX($A$1:$G$79,SMALL(IF($B$1:$B$79=$N$1,ROW($B$1:$B$79)),ROW(36:36)),6))","v":""},{"$f":"IF(ISERROR(INDEX($A$1:$G$79,SMALL(IF($B$1:$B$79=$N$1,ROW($B$1:$B$79)),ROW(36:36)),4)),\"\",INDEX($A$1:$G$79,SMALL(IF($B$1:$B$79=$N$1,ROW($B$1:$B$79)),ROW(36:36)),4))","v":""},{"$f":"IF(ISERROR(INDEX($A$1:$G$79,SMALL(IF($B$1:$B$79=$N$1,ROW($B$1:$B$79)),ROW(36:36)),5)),\"\",INDEX($A$1:$G$79,SMALL(IF($B$1:$B$79=$N$1,ROW($B$1:$B$79)),ROW(36:36)),5))","v":""},{"$f":"IF(ISERROR(INDEX($A$1:$G$79,SMALL(IF($B$1:$B$79=$N$1,ROW($B$1:$B$79)),ROW(36:36)),7)),\"\",INDEX($A$1:$G$79,SMALL(IF($B$1:$B$79=$N$1,ROW($B$1:$B$79)),ROW(36:36)),7))","v":""},{"$f":"IF(ISERROR(INDEX($A$1:$H$79,SMALL(IF($B$1:$B$79=$N$1,ROW($B$1:$B$79)),ROW(36:36)),8)),\"\",INDEX($A$1:$H$79,SMALL(IF($B$1:$B$79=$N$1,ROW($B$1:$B$79)),ROW(36:36)),8))","v":""},{"$f":"IF(ISERROR(INDEX($A$1:$G$79,SMALL(IF($C$1:$C$79=$S$1,ROW($C$1:$C$79)),ROW(36:36)),6)),\"\",INDEX($A$1:$G$79,SMALL(IF($C$1:$C$79=$S$1,ROW($C$1:$C$79)),ROW(36:36)),6))","v":""},{"$f":"IF(ISERROR(INDEX($A$1:$G$79,SMALL(IF($C$1:$C$79=$S$1,ROW($C$1:$C$79)),ROW(36:36)),4)),\"\",INDEX($A$1:$G$79,SMALL(IF($C$1:$C$79=$S$1,ROW($C$1:$C$79)),ROW(36:36)),4))","v":""},{"$f":"IF(ISERROR(INDEX($A$1:$G$79,SMALL(IF($C$1:$C$79=$S$1,ROW($C$1:$C$79)),ROW(36:36)),5)),\"\",INDEX($A$1:$G$79,SMALL(IF($C$1:$C$79=$S$1,ROW($C$1:$C$79)),ROW(36:36)),5))","v":""},{"$f":"IF(ISERROR(INDEX($A$1:$G$79,SMALL(IF($C$1:$C$79=$S$1,ROW($C$1:$C$79)),ROW(36:36)),7)),\"\",INDEX($A$1:$G$79,SMALL(IF($C$1:$C$79=$S$1,ROW($C$1:$C$79)),ROW(36:36)),7))","v":""},{"$f":"IF(ISERROR(INDEX($A$1:$H$79,SMALL(IF($C$1:$C$79=$S$1,ROW($C$1:$C$79)),ROW(36:36)),8)),\"\",INDEX($A$1:$H$79,SMALL(IF($C$1:$C$79=$S$1,ROW($C$1:$C$79)),ROW(36:36)),8))","v":""}," "]
[{"$f":"'Services & Housing'!F26","v":"Please select answer"},{"$f":"'Services & Housing'!G26","v":"Please select answer"},{"$f":"'Services & Housing'!H26","v":"Please select answer"},{"$f":"'Services & Housing'!B26","v":3},{"$f":"'Services & Housing'!C26","v":"The rules and regulations of the project are centered on participants’ rights"},{"$f":"'Services & Housing'!D26","v":"Project staff have realistic expectations and policies. Rules and regulations are designed to support safe and stable communities and should never interfere with a life in the community. Participants have access to the project at all hours (except for nightly in and out shelter) and accommodation is made for pets."},"Housing",{"$f":"F39","v":"Optional notes here"},{"$f":"IF(ISERROR(INDEX($A$1:$G$79,SMALL(IF($A$1:$A$79=$I$1,ROW($A$1:$A$79)),ROW(37:37)),7)),\"\",INDEX($A$1:$G$79,SMALL(IF($A$1:$A$79=$I$1,ROW($A$1:$A$79)),ROW(37:37)),7))","v":""},{"$f":"IF(ISERROR(INDEX($A$1:$G$79,SMALL(IF($A$1:$A$79=$I$1,ROW($A$1:$A$79)),ROW(37:37)),4)),\"\",INDEX($A$1:$G$79,SMALL(IF($A$1:$A$79=$I$1,ROW($A$1:$A$79)),ROW(37:37)),4))","v":""},{"$f":"IF(ISERROR(INDEX($A$1:$G$79,SMALL(IF($A$1:$A$79=$I$1,ROW($A$1:$A$79)),ROW(37:37)),5)),\"\",INDEX($A$1:$G$79,SMALL(IF($A$1:$A$79=$I$1,ROW($A$1:$A$79)),ROW(37:37)),5))","v":""},{"$f":"IF(ISERROR(INDEX($A$1:$G$79,SMALL(IF($A$1:$A$79=$I$1,ROW($A$1:$A$79)),ROW(37:37)),6)),\"\",INDEX($A$1:$G$79,SMALL(IF($A$1:$A$79=$I$1,ROW($A$1:$A$79)),ROW(37:37)),6))","v":""},{"$f":"IF(ISERROR(INDEX($A$1:$H$79,SMALL(IF($A$1:$A$79=$I$1,ROW($A$1:$A$79)),ROW(37:37)),8)),\"\",INDEX($A$1:$H$79,SMALL(IF($A$1:$A$79=$I$1,ROW($A$1:$A$79)),ROW(37:37)),8))","v":""},{"$f":"IF(ISERROR(INDEX($A$1:$G$79,SMALL(IF($B$1:$B$79=$N$1,ROW($B$1:$B$79)),ROW(37:37)),6)),\"\",INDEX($A$1:$G$79,SMALL(IF($B$1:$B$79=$N$1,ROW($B$1:$B$79)),ROW(37:37)),6))","v":""},{"$f":"IF(ISERROR(INDEX($A$1:$G$79,SMALL(IF($B$1:$B$79=$N$1,ROW($B$1:$B$79)),ROW(37:37)),4)),\"\",INDEX($A$1:$G$79,SMALL(IF($B$1:$B$79=$N$1,ROW($B$1:$B$79)),ROW(37:37)),4))","v":""},{"$f":"IF(ISERROR(INDEX($A$1:$G$79,SMALL(IF($B$1:$B$79=$N$1,ROW($B$1:$B$79)),ROW(37:37)),5)),\"\",INDEX($A$1:$G$79,SMALL(IF($B$1:$B$79=$N$1,ROW($B$1:$B$79)),ROW(37:37)),5))","v":""},{"$f":"IF(ISERROR(INDEX($A$1:$G$79,SMALL(IF($B$1:$B$79=$N$1,ROW($B$1:$B$79)),ROW(37:37)),7)),\"\",INDEX($A$1:$G$79,SMALL(IF($B$1:$B$79=$N$1,ROW($B$1:$B$79)),ROW(37:37)),7))","v":""},{"$f":"IF(ISERROR(INDEX($A$1:$H$79,SMALL(IF($B$1:$B$79=$N$1,ROW($B$1:$B$79)),ROW(37:37)),8)),\"\",INDEX($A$1:$H$79,SMALL(IF($B$1:$B$79=$N$1,ROW($B$1:$B$79)),ROW(37:37)),8))","v":""},{"$f":"IF(ISERROR(INDEX($A$1:$G$79,SMALL(IF($C$1:$C$79=$S$1,ROW($C$1:$C$79)),ROW(37:37)),6)),\"\",INDEX($A$1:$G$79,SMALL(IF($C$1:$C$79=$S$1,ROW($C$1:$C$79)),ROW(37:37)),6))","v":""},{"$f":"IF(ISERROR(INDEX($A$1:$G$79,SMALL(IF($C$1:$C$79=$S$1,ROW($C$1:$C$79)),ROW(37:37)),4)),\"\",INDEX($A$1:$G$79,SMALL(IF($C$1:$C$79=$S$1,ROW($C$1:$C$79)),ROW(37:37)),4))","v":""},{"$f":"IF(ISERROR(INDEX($A$1:$G$79,SMALL(IF($C$1:$C$79=$S$1,ROW($C$1:$C$79)),ROW(37:37)),5)),\"\",INDEX($A$1:$G$79,SMALL(IF($C$1:$C$79=$S$1,ROW($C$1:$C$79)),ROW(37:37)),5))","v":""},{"$f":"IF(ISERROR(INDEX($A$1:$G$79,SMALL(IF($C$1:$C$79=$S$1,ROW($C$1:$C$79)),ROW(37:37)),7)),\"\",INDEX($A$1:$G$79,SMALL(IF($C$1:$C$79=$S$1,ROW($C$1:$C$79)),ROW(37:37)),7))","v":""},{"$f":"IF(ISERROR(INDEX($A$1:$H$79,SMALL(IF($C$1:$C$79=$S$1,ROW($C$1:$C$79)),ROW(37:37)),8)),\"\",INDEX($A$1:$H$79,SMALL(IF($C$1:$C$79=$S$1,ROW($C$1:$C$79)),ROW(37:37)),8))","v":""}," "]
[{"$f":"'Services & Housing'!F27","v":0},{"$f":"'Services & Housing'!G27","v":0},{"$f":"'Services & Housing'!H27","v":0},{"$f":"'Services & Housing'!B27","v":0},{"$f":"'Services & Housing'!C27","v":0},{"$f":"'Services & Housing'!D27","v":"Optional notes here"},"Housing",0,{"$f":"IF(ISERROR(INDEX($A$1:$G$79,SMALL(IF($A$1:$A$79=$I$1,ROW($A$1:$A$79)),ROW(38:38)),7)),\"\",INDEX($A$1:$G$79,SMALL(IF($A$1:$A$79=$I$1,ROW($A$1:$A$79)),ROW(38:38)),7))","v":""},{"$f":"IF(ISERROR(INDEX($A$1:$G$79,SMALL(IF($A$1:$A$79=$I$1,ROW($A$1:$A$79)),ROW(38:38)),4)),\"\",INDEX($A$1:$G$79,SMALL(IF($A$1:$A$79=$I$1,ROW($A$1:$A$79)),ROW(38:38)),4))","v":""},{"$f":"IF(ISERROR(INDEX($A$1:$G$79,SMALL(IF($A$1:$A$79=$I$1,ROW($A$1:$A$79)),ROW(38:38)),5)),\"\",INDEX($A$1:$G$79,SMALL(IF($A$1:$A$79=$I$1,ROW($A$1:$A$79)),ROW(38:38)),5))","v":""},{"$f":"IF(ISERROR(INDEX($A$1:$G$79,SMALL(IF($A$1:$A$79=$I$1,ROW($A$1:$A$79)),ROW(38:38)),6)),\"\",INDEX($A$1:$G$79,SMALL(IF($A$1:$A$79=$I$1,ROW($A$1:$A$79)),ROW(38:38)),6))","v":""},{"$f":"IF(ISERROR(INDEX($A$1:$H$79,SMALL(IF($A$1:$A$79=$I$1,ROW($A$1:$A$79)),ROW(38:38)),8)),\"\",INDEX($A$1:$H$79,SMALL(IF($A$1:$A$79=$I$1,ROW($A$1:$A$79)),ROW(38:38)),8))","v":""},{"$f":"IF(ISERROR(INDEX($A$1:$G$79,SMALL(IF($B$1:$B$79=$N$1,ROW($B$1:$B$79)),ROW(38:38)),6)),\"\",INDEX($A$1:$G$79,SMALL(IF($B$1:$B$79=$N$1,ROW($B$1:$B$79)),ROW(38:38)),6))","v":""},{"$f":"IF(ISERROR(INDEX($A$1:$G$79,SMALL(IF($B$1:$B$79=$N$1,ROW($B$1:$B$79)),ROW(38:38)),4)),\"\",INDEX($A$1:$G$79,SMALL(IF($B$1:$B$79=$N$1,ROW($B$1:$B$79)),ROW(38:38)),4))","v":""},{"$f":"IF(ISERROR(INDEX($A$1:$G$79,SMALL(IF($B$1:$B$79=$N$1,ROW($B$1:$B$79)),ROW(38:38)),5)),\"\",INDEX($A$1:$G$79,SMALL(IF($B$1:$B$79=$N$1,ROW($B$1:$B$79)),ROW(38:38)),5))","v":""},{"$f":"IF(ISERROR(INDEX($A$1:$G$79,SMALL(IF($B$1:$B$79=$N$1,ROW($B$1:$B$79)),ROW(38:38)),7)),\"\",INDEX($A$1:$G$79,SMALL(IF($B$1:$B$79=$N$1,ROW($B$1:$B$79)),ROW(38:38)),7))","v":""},{"$f":"IF(ISERROR(INDEX($A$1:$H$79,SMALL(IF($B$1:$B$79=$N$1,ROW($B$1:$B$79)),ROW(38:38)),8)),\"\",INDEX($A$1:$H$79,SMALL(IF($B$1:$B$79=$N$1,ROW($B$1:$B$79)),ROW(38:38)),8))","v":""},{"$f":"IF(ISERROR(INDEX($A$1:$G$79,SMALL(IF($C$1:$C$79=$S$1,ROW($C$1:$C$79)),ROW(38:38)),6)),\"\",INDEX($A$1:$G$79,SMALL(IF($C$1:$C$79=$S$1,ROW($C$1:$C$79)),ROW(38:38)),6))","v":""},{"$f":"IF(ISERROR(INDEX($A$1:$G$79,SMALL(IF($C$1:$C$79=$S$1,ROW($C$1:$C$79)),ROW(38:38)),4)),\"\",INDEX($A$1:$G$79,SMALL(IF($C$1:$C$79=$S$1,ROW($C$1:$C$79)),ROW(38:38)),4))","v":""},{"$f":"IF(ISERROR(INDEX($A$1:$G$79,SMALL(IF($C$1:$C$79=$S$1,ROW($C$1:$C$79)),ROW(38:38)),5)),\"\",INDEX($A$1:$G$79,SMALL(IF($C$1:$C$79=$S$1,ROW($C$1:$C$79)),ROW(38:38)),5))","v":""},{"$f":"IF(ISERROR(INDEX($A$1:$G$79,SMALL(IF($C$1:$C$79=$S$1,ROW($C$1:$C$79)),ROW(38:38)),7)),\"\",INDEX($A$1:$G$79,SMALL(IF($C$1:$C$79=$S$1,ROW($C$1:$C$79)),ROW(38:38)),7))","v":""},{"$f":"IF(ISERROR(INDEX($A$1:$H$79,SMALL(IF($C$1:$C$79=$S$1,ROW($C$1:$C$79)),ROW(38:38)),8)),\"\",INDEX($A$1:$H$79,SMALL(IF($C$1:$C$79=$S$1,ROW($C$1:$C$79)),ROW(38:38)),8))","v":""}," "]
[{"$f":"'Services & Housing'!F28","v":"Please select answer"},{"$f":"'Services & Housing'!G28","v":"Please select answer"},{"$f":"'Services & Housing'!H28","v":"Please select answer"},{"$f":"'Services & Housing'!B28","v":4},{"$f":"'Services & Housing'!C28","v":"Participants have the option to transfer to another project"},{"$f":"'Services & Housing'!D28","v":"Transfers should be accommodated for tenants who reasonably believe that they are threatened with imminent harm from further violence if the tenant remains in the same unit. Whenever possible, transfers occur before a participant experiences homelessness.  "},"Housing",{"$f":"F41","v":"Optional notes here"},{"$f":"IF(ISERROR(INDEX($A$1:$G$79,SMALL(IF($A$1:$A$79=$I$1,ROW($A$1:$A$79)),ROW(39:39)),7)),\"\",INDEX($A$1:$G$79,SMALL(IF($A$1:$A$79=$I$1,ROW($A$1:$A$79)),ROW(39:39)),7))","v":""},{"$f":"IF(ISERROR(INDEX($A$1:$G$79,SMALL(IF($A$1:$A$79=$I$1,ROW($A$1:$A$79)),ROW(39:39)),4)),\"\",INDEX($A$1:$G$79,SMALL(IF($A$1:$A$79=$I$1,ROW($A$1:$A$79)),ROW(39:39)),4))","v":""},{"$f":"IF(ISERROR(INDEX($A$1:$G$79,SMALL(IF($A$1:$A$79=$I$1,ROW($A$1:$A$79)),ROW(39:39)),5)),\"\",INDEX($A$1:$G$79,SMALL(IF($A$1:$A$79=$I$1,ROW($A$1:$A$79)),ROW(39:39)),5))","v":""},{"$f":"IF(ISERROR(INDEX($A$1:$G$79,SMALL(IF($A$1:$A$79=$I$1,ROW($A$1:$A$79)),ROW(39:39)),6)),\"\",INDEX($A$1:$G$79,SMALL(IF($A$1:$A$79=$I$1,ROW($A$1:$A$79)),ROW(39:39)),6))","v":""},{"$f":"IF(ISERROR(INDEX($A$1:$H$79,SMALL(IF($A$1:$A$79=$I$1,ROW($A$1:$A$79)),ROW(39:39)),8)),\"\",INDEX($A$1:$H$79,SMALL(IF($A$1:$A$79=$I$1,ROW($A$1:$A$79)),ROW(39:39)),8))","v":""},{"$f":"IF(ISERROR(INDEX($A$1:$G$79,SMALL(IF($B$1:$B$79=$N$1,ROW($B$1:$B$79)),ROW(39:39)),6)),\"\",INDEX($A$1:$G$79,SMALL(IF($B$1:$B$79=$N$1,ROW($B$1:$B$79)),ROW(39:39)),6))","v":""},{"$f":"IF(ISERROR(INDEX($A$1:$G$79,SMALL(IF($B$1:$B$79=$N$1,ROW($B$1:$B$79)),ROW(39:39)),4)),\"\",INDEX($A$1:$G$79,SMALL(IF($B$1:$B$79=$N$1,ROW($B$1:$B$79)),ROW(39:39)),4))","v":""},{"$f":"IF(ISERROR(INDEX($A$1:$G$79,SMALL(IF($B$1:$B$79=$N$1,ROW($B$1:$B$79)),ROW(39:39)),5)),\"\",INDEX($A$1:$G$79,SMALL(IF($B$1:$B$79=$N$1,ROW($B$1:$B$79)),ROW(39:39)),5))","v":""},{"$f":"IF(ISERROR(INDEX($A$1:$G$79,SMALL(IF($B$1:$B$79=$N$1,ROW($B$1:$B$79)),ROW(39:39)),7)),\"\",INDEX($A$1:$G$79,SMALL(IF($B$1:$B$79=$N$1,ROW($B$1:$B$79)),ROW(39:39)),7))","v":""},{"$f":"IF(ISERROR(INDEX($A$1:$H$79,SMALL(IF($B$1:$B$79=$N$1,ROW($B$1:$B$79)),ROW(39:39)),8)),\"\",INDEX($A$1:$H$79,SMALL(IF($B$1:$B$79=$N$1,ROW($B$1:$B$79)),ROW(39:39)),8))","v":""},{"$f":"IF(ISERROR(INDEX($A$1:$G$79,SMALL(IF($C$1:$C$79=$S$1,ROW($C$1:$C$79)),ROW(39:39)),6)),\"\",INDEX($A$1:$G$79,SMALL(IF($C$1:$C$79=$S$1,ROW($C$1:$C$79)),ROW(39:39)),6))","v":""},{"$f":"IF(ISERROR(INDEX($A$1:$G$79,SMALL(IF($C$1:$C$79=$S$1,ROW($C$1:$C$79)),ROW(39:39)),4)),\"\",INDEX($A$1:$G$79,SMALL(IF($C$1:$C$79=$S$1,ROW($C$1:$C$79)),ROW(39:39)),4))","v":""},{"$f":"IF(ISERROR(INDEX($A$1:$G$79,SMALL(IF($C$1:$C$79=$S$1,ROW($C$1:$C$79)),ROW(39:39)),5)),\"\",INDEX($A$1:$G$79,SMALL(IF($C$1:$C$79=$S$1,ROW($C$1:$C$79)),ROW(39:39)),5))","v":""},{"$f":"IF(ISERROR(INDEX($A$1:$G$79,SMALL(IF($C$1:$C$79=$S$1,ROW($C$1:$C$79)),ROW(39:39)),7)),\"\",INDEX($A$1:$G$79,SMALL(IF($C$1:$C$79=$S$1,ROW($C$1:$C$79)),ROW(39:39)),7))","v":""},{"$f":"IF(ISERROR(INDEX($A$1:$H$79,SMALL(IF($C$1:$C$79=$S$1,ROW($C$1:$C$79)),ROW(39:39)),8)),\"\",INDEX($A$1:$H$79,SMALL(IF($C$1:$C$79=$S$1,ROW($C$1:$C$79)),ROW(39:39)),8))","v":""}," "]
[{"$f":"'Services & Housing'!F29","v":0},{"$f":"'Services & Housing'!G29","v":0},{"$f":"'Services & Housing'!H29","v":0},{"$f":"'Services & Housing'!B29","v":0},{"$f":"'Services & Housing'!C29","v":0},{"$f":"'Services & Housing'!D29","v":"Optional notes here"},"Housing",0,{"$f":"IF(ISERROR(INDEX($A$1:$G$79,SMALL(IF($A$1:$A$79=$I$1,ROW($A$1:$A$79)),ROW(40:40)),7)),\"\",INDEX($A$1:$G$79,SMALL(IF($A$1:$A$79=$I$1,ROW($A$1:$A$79)),ROW(40:40)),7))","v":""},{"$f":"IF(ISERROR(INDEX($A$1:$G$79,SMALL(IF($A$1:$A$79=$I$1,ROW($A$1:$A$79)),ROW(40:40)),4)),\"\",INDEX($A$1:$G$79,SMALL(IF($A$1:$A$79=$I$1,ROW($A$1:$A$79)),ROW(40:40)),4))","v":""},{"$f":"IF(ISERROR(INDEX($A$1:$G$79,SMALL(IF($A$1:$A$79=$I$1,ROW($A$1:$A$79)),ROW(40:40)),5)),\"\",INDEX($A$1:$G$79,SMALL(IF($A$1:$A$79=$I$1,ROW($A$1:$A$79)),ROW(40:40)),5))","v":""},{"$f":"IF(ISERROR(INDEX($A$1:$G$79,SMALL(IF($A$1:$A$79=$I$1,ROW($A$1:$A$79)),ROW(40:40)),6)),\"\",INDEX($A$1:$G$79,SMALL(IF($A$1:$A$79=$I$1,ROW($A$1:$A$79)),ROW(40:40)),6))","v":""},{"$f":"IF(ISERROR(INDEX($A$1:$H$79,SMALL(IF($A$1:$A$79=$I$1,ROW($A$1:$A$79)),ROW(40:40)),8)),\"\",INDEX($A$1:$H$79,SMALL(IF($A$1:$A$79=$I$1,ROW($A$1:$A$79)),ROW(40:40)),8))","v":""},{"$f":"IF(ISERROR(INDEX($A$1:$G$79,SMALL(IF($B$1:$B$79=$N$1,ROW($B$1:$B$79)),ROW(40:40)),6)),\"\",INDEX($A$1:$G$79,SMALL(IF($B$1:$B$79=$N$1,ROW($B$1:$B$79)),ROW(40:40)),6))","v":""},{"$f":"IF(ISERROR(INDEX($A$1:$G$79,SMALL(IF($B$1:$B$79=$N$1,ROW($B$1:$B$79)),ROW(40:40)),4)),\"\",INDEX($A$1:$G$79,SMALL(IF($B$1:$B$79=$N$1,ROW($B$1:$B$79)),ROW(40:40)),4))","v":""},{"$f":"IF(ISERROR(INDEX($A$1:$G$79,SMALL(IF($B$1:$B$79=$N$1,ROW($B$1:$B$79)),ROW(40:40)),5)),\"\",INDEX($A$1:$G$79,SMALL(IF($B$1:$B$79=$N$1,ROW($B$1:$B$79)),ROW(40:40)),5))","v":""},{"$f":"IF(ISERROR(INDEX($A$1:$G$79,SMALL(IF($B$1:$B$79=$N$1,ROW($B$1:$B$79)),ROW(40:40)),7)),\"\",INDEX($A$1:$G$79,SMALL(IF($B$1:$B$79=$N$1,ROW($B$1:$B$79)),ROW(40:40)),7))","v":""},{"$f":"IF(ISERROR(INDEX($A$1:$H$79,SMALL(IF($B$1:$B$79=$N$1,ROW($B$1:$B$79)),ROW(40:40)),8)),\"\",INDEX($A$1:$H$79,SMALL(IF($B$1:$B$79=$N$1,ROW($B$1:$B$79)),ROW(40:40)),8))","v":""},{"$f":"IF(ISERROR(INDEX($A$1:$G$79,SMALL(IF($C$1:$C$79=$S$1,ROW($C$1:$C$79)),ROW(40:40)),6)),\"\",INDEX($A$1:$G$79,SMALL(IF($C$1:$C$79=$S$1,ROW($C$1:$C$79)),ROW(40:40)),6))","v":""},{"$f":"IF(ISERROR(INDEX($A$1:$G$79,SMALL(IF($C$1:$C$79=$S$1,ROW($C$1:$C$79)),ROW(40:40)),4)),\"\",INDEX($A$1:$G$79,SMALL(IF($C$1:$C$79=$S$1,ROW($C$1:$C$79)),ROW(40:40)),4))","v":""},{"$f":"IF(ISERROR(INDEX($A$1:$G$79,SMALL(IF($C$1:$C$79=$S$1,ROW($C$1:$C$79)),ROW(40:40)),5)),\"\",INDEX($A$1:$G$79,SMALL(IF($C$1:$C$79=$S$1,ROW($C$1:$C$79)),ROW(40:40)),5))","v":""},{"$f":"IF(ISERROR(INDEX($A$1:$G$79,SMALL(IF($C$1:$C$79=$S$1,ROW($C$1:$C$79)),ROW(40:40)),7)),\"\",INDEX($A$1:$G$79,SMALL(IF($C$1:$C$79=$S$1,ROW($C$1:$C$79)),ROW(40:40)),7))","v":""},{"$f":"IF(ISERROR(INDEX($A$1:$H$79,SMALL(IF($C$1:$C$79=$S$1,ROW($C$1:$C$79)),ROW(40:40)),8)),\"\",INDEX($A$1:$H$79,SMALL(IF($C$1:$C$79=$S$1,ROW($C$1:$C$79)),ROW(40:40)),8))","v":""}," "]
[{"$f":"Leases!F7","v":"Please select answer"},{"$f":"Leases!G7","v":"Please select answer"},{"$f":"Leases!H7","v":"Please select answer"},{"$f":"Leases!B7","v":1},{"$f":"Leases!C7","v":"Housing is considered permanent (not applicable for Transitional Housing)"},{"$f":"Leases!D7","v":"Housing is not time-limited (though rent assistance may be) and leases are automatically renewable upon expiration, except with prior notice by either party. "},"Leases",{"$f":"F43","v":"Optional notes here"},{"$f":"IF(ISERROR(INDEX($A$1:$G$79,SMALL(IF($A$1:$A$79=$I$1,ROW($A$1:$A$79)),ROW(#REF!)),7)),\"\",INDEX($A$1:$G$79,SMALL(IF($A$1:$A$79=$I$1,ROW($A$1:$A$79)),ROW(#REF!)),7))","v":""},{"$f":"IF(ISERROR(INDEX($A$1:$G$79,SMALL(IF($A$1:$A$79=$I$1,ROW($A$1:$A$79)),ROW(#REF!)),4)),\"\",INDEX($A$1:$G$79,SMALL(IF($A$1:$A$79=$I$1,ROW($A$1:$A$79)),ROW(#REF!)),4))","v":""},{"$f":"IF(ISERROR(INDEX($A$1:$G$79,SMALL(IF($A$1:$A$79=$I$1,ROW($A$1:$A$79)),ROW(#REF!)),5)),\"\",INDEX($A$1:$G$79,SMALL(IF($A$1:$A$79=$I$1,ROW($A$1:$A$79)),ROW(#REF!)),5))","v":""},{"$f":"IF(ISERROR(INDEX($A$1:$G$79,SMALL(IF($A$1:$A$79=$I$1,ROW($A$1:$A$79)),ROW(#REF!)),6)),\"\",INDEX($A$1:$G$79,SMALL(IF($A$1:$A$79=$I$1,ROW($A$1:$A$79)),ROW(#REF!)),6))","v":""},{"$f":"IF(ISERROR(INDEX($A$1:$H$79,SMALL(IF($A$1:$A$79=$I$1,ROW($A$1:$A$79)),ROW(#REF!)),8)),\"\",INDEX($A$1:$H$79,SMALL(IF($A$1:$A$79=$I$1,ROW($A$1:$A$79)),ROW(#REF!)),8))","v":""},{"$f":"IF(ISERROR(INDEX($A$1:$G$79,SMALL(IF($B$1:$B$79=$N$1,ROW($B$1:$B$79)),ROW(#REF!)),6)),\"\",INDEX($A$1:$G$79,SMALL(IF($B$1:$B$79=$N$1,ROW($B$1:$B$79)),ROW(#REF!)),6))","v":""},{"$f":"IF(ISERROR(INDEX($A$1:$G$79,SMALL(IF($B$1:$B$79=$N$1,ROW($B$1:$B$79)),ROW(#REF!)),4)),\"\",INDEX($A$1:$G$79,SMALL(IF($B$1:$B$79=$N$1,ROW($B$1:$B$79)),ROW(#REF!)),4))","v":""},{"$f":"IF(ISERROR(INDEX($A$1:$G$79,SMALL(IF($B$1:$B$79=$N$1,ROW($B$1:$B$79)),ROW(#REF!)),5)),\"\",INDEX($A$1:$G$79,SMALL(IF($B$1:$B$79=$N$1,ROW($B$1:$B$79)),ROW(#REF!)),5))","v":""},{"$f":"IF(ISERROR(INDEX($A$1:$G$79,SMALL(IF($B$1:$B$79=$N$1,ROW($B$1:$B$79)),ROW(#REF!)),7)),\"\",INDEX($A$1:$G$79,SMALL(IF($B$1:$B$79=$N$1,ROW($B$1:$B$79)),ROW(#REF!)),7))","v":""},{"$f":"IF(ISERROR(INDEX($A$1:$H$79,SMALL(IF($B$1:$B$79=$N$1,ROW($B$1:$B$79)),ROW(#REF!)),8)),\"\",INDEX($A$1:$H$79,SMALL(IF($B$1:$B$79=$N$1,ROW($B$1:$B$79)),ROW(#REF!)),8))","v":""},{"$f":"IF(ISERROR(INDEX($A$1:$G$79,SMALL(IF($C$1:$C$79=$S$1,ROW($C$1:$C$79)),ROW(#REF!)),6)),\"\",INDEX($A$1:$G$79,SMALL(IF($C$1:$C$79=$S$1,ROW($C$1:$C$79)),ROW(#REF!)),6))","v":""},{"$f":"IF(ISERROR(INDEX($A$1:$G$79,SMALL(IF($C$1:$C$79=$S$1,ROW($C$1:$C$79)),ROW(#REF!)),4)),\"\",INDEX($A$1:$G$79,SMALL(IF($C$1:$C$79=$S$1,ROW($C$1:$C$79)),ROW(#REF!)),4))","v":""},{"$f":"IF(ISERROR(INDEX($A$1:$G$79,SMALL(IF($C$1:$C$79=$S$1,ROW($C$1:$C$79)),ROW(#REF!)),5)),\"\",INDEX($A$1:$G$79,SMALL(IF($C$1:$C$79=$S$1,ROW($C$1:$C$79)),ROW(#REF!)),5))","v":""},{"$f":"IF(ISERROR(INDEX($A$1:$G$79,SMALL(IF($C$1:$C$79=$S$1,ROW($C$1:$C$79)),ROW(#REF!)),7)),\"\",INDEX($A$1:$G$79,SMALL(IF($C$1:$C$79=$S$1,ROW($C$1:$C$79)),ROW(#REF!)),7))","v":""},{"$f":"IF(ISERROR(INDEX($A$1:$H$79,SMALL(IF($C$1:$C$79=$S$1,ROW($C$1:$C$79)),ROW(#REF!)),8)),\"\",INDEX($A$1:$H$79,SMALL(IF($C$1:$C$79=$S$1,ROW($C$1:$C$79)),ROW(#REF!)),8))","v":""}," "]
[{"$f":"Leases!F8","v":0},{"$f":"Leases!G8","v":0},{"$f":"Leases!H8","v":0},{"$f":"Leases!B8","v":0},{"$f":"Leases!C8","v":0},{"$f":"Leases!D8","v":"Optional notes here"},"Leases",0,{"$f":"IF(ISERROR(INDEX($A$1:$G$79,SMALL(IF($A$1:$A$79=$I$1,ROW($A$1:$A$79)),ROW(42:42)),7)),\"\",INDEX($A$1:$G$79,SMALL(IF($A$1:$A$79=$I$1,ROW($A$1:$A$79)),ROW(42:42)),7))","v":""},{"$f":"IF(ISERROR(INDEX($A$1:$G$79,SMALL(IF($A$1:$A$79=$I$1,ROW($A$1:$A$79)),ROW(42:42)),4)),\"\",INDEX($A$1:$G$79,SMALL(IF($A$1:$A$79=$I$1,ROW($A$1:$A$79)),ROW(42:42)),4))","v":""},{"$f":"IF(ISERROR(INDEX($A$1:$G$79,SMALL(IF($A$1:$A$79=$I$1,ROW($A$1:$A$79)),ROW(42:42)),5)),\"\",INDEX($A$1:$G$79,SMALL(IF($A$1:$A$79=$I$1,ROW($A$1:$A$79)),ROW(42:42)),5))","v":""},{"$f":"IF(ISERROR(INDEX($A$1:$G$79,SMALL(IF($A$1:$A$79=$I$1,ROW($A$1:$A$79)),ROW(42:42)),6)),\"\",INDEX($A$1:$G$79,SMALL(IF($A$1:$A$79=$I$1,ROW($A$1:$A$79)),ROW(42:42)),6))","v":""},{"$f":"IF(ISERROR(INDEX($A$1:$H$79,SMALL(IF($A$1:$A$79=$I$1,ROW($A$1:$A$79)),ROW(42:42)),8)),\"\",INDEX($A$1:$H$79,SMALL(IF($A$1:$A$79=$I$1,ROW($A$1:$A$79)),ROW(42:42)),8))","v":""},{"$f":"IF(ISERROR(INDEX($A$1:$G$79,SMALL(IF($B$1:$B$79=$N$1,ROW($B$1:$B$79)),ROW(42:42)),6)),\"\",INDEX($A$1:$G$79,SMALL(IF($B$1:$B$79=$N$1,ROW($B$1:$B$79)),ROW(42:42)),6))","v":""},{"$f":"IF(ISERROR(INDEX($A$1:$G$79,SMALL(IF($B$1:$B$79=$N$1,ROW($B$1:$B$79)),ROW(42:42)),4)),\"\",INDEX($A$1:$G$79,SMALL(IF($B$1:$B$79=$N$1,ROW($B$1:$B$79)),ROW(42:42)),4))","v":""},{"$f":"IF(ISERROR(INDEX($A$1:$G$79,SMALL(IF($B$1:$B$79=$N$1,ROW($B$1:$B$79)),ROW(42:42)),5)),\"\",INDEX($A$1:$G$79,SMALL(IF($B$1:$B$79=$N$1,ROW($B$1:$B$79)),ROW(42:42)),5))","v":""},{"$f":"IF(ISERROR(INDEX($A$1:$G$79,SMALL(IF($B$1:$B$79=$N$1,ROW($B$1:$B$79)),ROW(42:42)),7)),\"\",INDEX($A$1:$G$79,SMALL(IF($B$1:$B$79=$N$1,ROW($B$1:$B$79)),ROW(42:42)),7))","v":""},{"$f":"IF(ISERROR(INDEX($A$1:$H$79,SMALL(IF($B$1:$B$79=$N$1,ROW($B$1:$B$79)),ROW(42:42)),8)),\"\",INDEX($A$1:$H$79,SMALL(IF($B$1:$B$79=$N$1,ROW($B$1:$B$79)),ROW(42:42)),8))","v":""},{"$f":"IF(ISERROR(INDEX($A$1:$G$79,SMALL(IF($C$1:$C$79=$S$1,ROW($C$1:$C$79)),ROW(42:42)),6)),\"\",INDEX($A$1:$G$79,SMALL(IF($C$1:$C$79=$S$1,ROW($C$1:$C$79)),ROW(42:42)),6))","v":""},{"$f":"IF(ISERROR(INDEX($A$1:$G$79,SMALL(IF($C$1:$C$79=$S$1,ROW($C$1:$C$79)),ROW(42:42)),4)),\"\",INDEX($A$1:$G$79,SMALL(IF($C$1:$C$79=$S$1,ROW($C$1:$C$79)),ROW(42:42)),4))","v":""},{"$f":"IF(ISERROR(INDEX($A$1:$G$79,SMALL(IF($C$1:$C$79=$S$1,ROW($C$1:$C$79)),ROW(42:42)),5)),\"\",INDEX($A$1:$G$79,SMALL(IF($C$1:$C$79=$S$1,ROW($C$1:$C$79)),ROW(42:42)),5))","v":""},{"$f":"IF(ISERROR(INDEX($A$1:$G$79,SMALL(IF($C$1:$C$79=$S$1,ROW($C$1:$C$79)),ROW(42:42)),7)),\"\",INDEX($A$1:$G$79,SMALL(IF($C$1:$C$79=$S$1,ROW($C$1:$C$79)),ROW(42:42)),7))","v":""},{"$f":"IF(ISERROR(INDEX($A$1:$H$79,SMALL(IF($C$1:$C$79=$S$1,ROW($C$1:$C$79)),ROW(42:42)),8)),\"\",INDEX($A$1:$H$79,SMALL(IF($C$1:$C$79=$S$1,ROW($C$1:$C$79)),ROW(42:42)),8))","v":""}," "]
[{"$f":"Leases!F9","v":"Please select answer"},{"$f":"Leases!G9","v":"Please select answer"},{"$f":"Leases!H9","v":"Please select answer"},{"$f":"Leases!B9","v":2},{"$f":"Leases!C9","v":"Participant choice is fundamental"},{"$f":"Leases!D9","v":"A participant has, at minimum, choices in deciding the location and type of housing based on preferences from a range of housing types and among multiple units, as available and as practical. In project-based settings, participants should be offered choice of units within a particular building, or within the portfolio of single site properties. In projects that use shared housing, i.e. housing with unrelated roommates, participants should be offered choice of roommates, as available and as practical. Additionally, as applicable, participants are able to choose their roommates when sharing a room or unit."},"Leases",{"$f":"F45","v":"Optional notes here"},{"$f":"IF(ISERROR(INDEX($A$1:$G$79,SMALL(IF($A$1:$A$79=$I$1,ROW($A$1:$A$79)),ROW(43:43)),7)),\"\",INDEX($A$1:$G$79,SMALL(IF($A$1:$A$79=$I$1,ROW($A$1:$A$79)),ROW(43:43)),7))","v":""},{"$f":"IF(ISERROR(INDEX($A$1:$G$79,SMALL(IF($A$1:$A$79=$I$1,ROW($A$1:$A$79)),ROW(43:43)),4)),\"\",INDEX($A$1:$G$79,SMALL(IF($A$1:$A$79=$I$1,ROW($A$1:$A$79)),ROW(43:43)),4))","v":""},{"$f":"IF(ISERROR(INDEX($A$1:$G$79,SMALL(IF($A$1:$A$79=$I$1,ROW($A$1:$A$79)),ROW(43:43)),5)),\"\",INDEX($A$1:$G$79,SMALL(IF($A$1:$A$79=$I$1,ROW($A$1:$A$79)),ROW(43:43)),5))","v":""},{"$f":"IF(ISERROR(INDEX($A$1:$G$79,SMALL(IF($A$1:$A$79=$I$1,ROW($A$1:$A$79)),ROW(43:43)),6)),\"\",INDEX($A$1:$G$79,SMALL(IF($A$1:$A$79=$I$1,ROW($A$1:$A$79)),ROW(43:43)),6))","v":""},{"$f":"IF(ISERROR(INDEX($A$1:$H$79,SMALL(IF($A$1:$A$79=$I$1,ROW($A$1:$A$79)),ROW(43:43)),8)),\"\",INDEX($A$1:$H$79,SMALL(IF($A$1:$A$79=$I$1,ROW($A$1:$A$79)),ROW(43:43)),8))","v":""},{"$f":"IF(ISERROR(INDEX($A$1:$G$79,SMALL(IF($B$1:$B$79=$N$1,ROW($B$1:$B$79)),ROW(43:43)),6)),\"\",INDEX($A$1:$G$79,SMALL(IF($B$1:$B$79=$N$1,ROW($B$1:$B$79)),ROW(43:43)),6))","v":""},{"$f":"IF(ISERROR(INDEX($A$1:$G$79,SMALL(IF($B$1:$B$79=$N$1,ROW($B$1:$B$79)),ROW(43:43)),4)),\"\",INDEX($A$1:$G$79,SMALL(IF($B$1:$B$79=$N$1,ROW($B$1:$B$79)),ROW(43:43)),4))","v":""},{"$f":"IF(ISERROR(INDEX($A$1:$G$79,SMALL(IF($B$1:$B$79=$N$1,ROW($B$1:$B$79)),ROW(43:43)),5)),\"\",INDEX($A$1:$G$79,SMALL(IF($B$1:$B$79=$N$1,ROW($B$1:$B$79)),ROW(43:43)),5))","v":""},{"$f":"IF(ISERROR(INDEX($A$1:$G$79,SMALL(IF($B$1:$B$79=$N$1,ROW($B$1:$B$79)),ROW(43:43)),7)),\"\",INDEX($A$1:$G$79,SMALL(IF($B$1:$B$79=$N$1,ROW($B$1:$B$79)),ROW(43:43)),7))","v":""},{"$f":"IF(ISERROR(INDEX($A$1:$H$79,SMALL(IF($B$1:$B$79=$N$1,ROW($B$1:$B$79)),ROW(43:43)),8)),\"\",INDEX($A$1:$H$79,SMALL(IF($B$1:$B$79=$N$1,ROW($B$1:$B$79)),ROW(43:43)),8))","v":""},{"$f":"IF(ISERROR(INDEX($A$1:$G$79,SMALL(IF($C$1:$C$79=$S$1,ROW($C$1:$C$79)),ROW(43:43)),6)),\"\",INDEX($A$1:$G$79,SMALL(IF($C$1:$C$79=$S$1,ROW($C$1:$C$79)),ROW(43:43)),6))","v":""},{"$f":"IF(ISERROR(INDEX($A$1:$G$79,SMALL(IF($C$1:$C$79=$S$1,ROW($C$1:$C$79)),ROW(43:43)),4)),\"\",INDEX($A$1:$G$79,SMALL(IF($C$1:$C$79=$S$1,ROW($C$1:$C$79)),ROW(43:43)),4))","v":""},{"$f":"IF(ISERROR(INDEX($A$1:$G$79,SMALL(IF($C$1:$C$79=$S$1,ROW($C$1:$C$79)),ROW(43:43)),5)),\"\",INDEX($A$1:$G$79,SMALL(IF($C$1:$C$79=$S$1,ROW($C$1:$C$79)),ROW(43:43)),5))","v":""},{"$f":"IF(ISERROR(INDEX($A$1:$G$79,SMALL(IF($C$1:$C$79=$S$1,ROW($C$1:$C$79)),ROW(43:43)),7)),\"\",INDEX($A$1:$G$79,SMALL(IF($C$1:$C$79=$S$1,ROW($C$1:$C$79)),ROW(43:43)),7))","v":""},{"$f":"IF(ISERROR(INDEX($A$1:$H$79,SMALL(IF($C$1:$C$79=$S$1,ROW($C$1:$C$79)),ROW(43:43)),8)),\"\",INDEX($A$1:$H$79,SMALL(IF($C$1:$C$79=$S$1,ROW($C$1:$C$79)),ROW(43:43)),8))","v":""}," "]
[{"$f":"Leases!F10","v":0},{"$f":"Leases!G10","v":0},{"$f":"Leases!H10","v":0},{"$f":"Leases!B10","v":0},{"$f":"Leases!C10","v":0},{"$f":"Leases!D10","v":"Optional notes here"},"Leases",0,{"$f":"IF(ISERROR(INDEX($A$1:$G$79,SMALL(IF($A$1:$A$79=$I$1,ROW($A$1:$A$79)),ROW(44:44)),7)),\"\",INDEX($A$1:$G$79,SMALL(IF($A$1:$A$79=$I$1,ROW($A$1:$A$79)),ROW(44:44)),7))","v":""},{"$f":"IF(ISERROR(INDEX($A$1:$G$79,SMALL(IF($A$1:$A$79=$I$1,ROW($A$1:$A$79)),ROW(44:44)),4)),\"\",INDEX($A$1:$G$79,SMALL(IF($A$1:$A$79=$I$1,ROW($A$1:$A$79)),ROW(44:44)),4))","v":""},{"$f":"IF(ISERROR(INDEX($A$1:$G$79,SMALL(IF($A$1:$A$79=$I$1,ROW($A$1:$A$79)),ROW(44:44)),5)),\"\",INDEX($A$1:$G$79,SMALL(IF($A$1:$A$79=$I$1,ROW($A$1:$A$79)),ROW(44:44)),5))","v":""},{"$f":"IF(ISERROR(INDEX($A$1:$G$79,SMALL(IF($A$1:$A$79=$I$1,ROW($A$1:$A$79)),ROW(44:44)),6)),\"\",INDEX($A$1:$G$79,SMALL(IF($A$1:$A$79=$I$1,ROW($A$1:$A$79)),ROW(44:44)),6))","v":""},{"$f":"IF(ISERROR(INDEX($A$1:$H$79,SMALL(IF($A$1:$A$79=$I$1,ROW($A$1:$A$79)),ROW(44:44)),8)),\"\",INDEX($A$1:$H$79,SMALL(IF($A$1:$A$79=$I$1,ROW($A$1:$A$79)),ROW(44:44)),8))","v":""},{"$f":"IF(ISERROR(INDEX($A$1:$G$79,SMALL(IF($B$1:$B$79=$N$1,ROW($B$1:$B$79)),ROW(44:44)),6)),\"\",INDEX($A$1:$G$79,SMALL(IF($B$1:$B$79=$N$1,ROW($B$1:$B$79)),ROW(44:44)),6))","v":""},{"$f":"IF(ISERROR(INDEX($A$1:$G$79,SMALL(IF($B$1:$B$79=$N$1,ROW($B$1:$B$79)),ROW(44:44)),4)),\"\",INDEX($A$1:$G$79,SMALL(IF($B$1:$B$79=$N$1,ROW($B$1:$B$79)),ROW(44:44)),4))","v":""},{"$f":"IF(ISERROR(INDEX($A$1:$G$79,SMALL(IF($B$1:$B$79=$N$1,ROW($B$1:$B$79)),ROW(44:44)),5)),\"\",INDEX($A$1:$G$79,SMALL(IF($B$1:$B$79=$N$1,ROW($B$1:$B$79)),ROW(44:44)),5))","v":""},{"$f":"IF(ISERROR(INDEX($A$1:$G$79,SMALL(IF($B$1:$B$79=$N$1,ROW($B$1:$B$79)),ROW(44:44)),7)),\"\",INDEX($A$1:$G$79,SMALL(IF($B$1:$B$79=$N$1,ROW($B$1:$B$79)),ROW(44:44)),7))","v":""},{"$f":"IF(ISERROR(INDEX($A$1:$H$79,SMALL(IF($B$1:$B$79=$N$1,ROW($B$1:$B$79)),ROW(44:44)),8)),\"\",INDEX($A$1:$H$79,SMALL(IF($B$1:$B$79=$N$1,ROW($B$1:$B$79)),ROW(44:44)),8))","v":""},{"$f":"IF(ISERROR(INDEX($A$1:$G$79,SMALL(IF($C$1:$C$79=$S$1,ROW($C$1:$C$79)),ROW(44:44)),6)),\"\",INDEX($A$1:$G$79,SMALL(IF($C$1:$C$79=$S$1,ROW($C$1:$C$79)),ROW(44:44)),6))","v":""},{"$f":"IF(ISERROR(INDEX($A$1:$G$79,SMALL(IF($C$1:$C$79=$S$1,ROW($C$1:$C$79)),ROW(44:44)),4)),\"\",INDEX($A$1:$G$79,SMALL(IF($C$1:$C$79=$S$1,ROW($C$1:$C$79)),ROW(44:44)),4))","v":""},{"$f":"IF(ISERROR(INDEX($A$1:$G$79,SMALL(IF($C$1:$C$79=$S$1,ROW($C$1:$C$79)),ROW(44:44)),5)),\"\",INDEX($A$1:$G$79,SMALL(IF($C$1:$C$79=$S$1,ROW($C$1:$C$79)),ROW(44:44)),5))","v":""},{"$f":"IF(ISERROR(INDEX($A$1:$G$79,SMALL(IF($C$1:$C$79=$S$1,ROW($C$1:$C$79)),ROW(44:44)),7)),\"\",INDEX($A$1:$G$79,SMALL(IF($C$1:$C$79=$S$1,ROW($C$1:$C$79)),ROW(44:44)),7))","v":""},{"$f":"IF(ISERROR(INDEX($A$1:$H$79,SMALL(IF($C$1:$C$79=$S$1,ROW($C$1:$C$79)),ROW(44:44)),8)),\"\",INDEX($A$1:$H$79,SMALL(IF($C$1:$C$79=$S$1,ROW($C$1:$C$79)),ROW(44:44)),8))","v":""}," "]
[{"$f":"Leases!F11","v":"Please select answer"},{"$f":"Leases!G11","v":"Please select answer"},{"$f":"Leases!H11","v":"Please select answer"},{"$f":"Leases!B11","v":3},{"$f":"Leases!C11","v":"Leases are the same for participants as for other tenants"},{"$f":"Leases!D11","v":"Leases do not have any provisions that would not be found in leases held by any other tenant in the property or building and is renewable per the participants’ and owner’s choice. People experiencing homelessness who receive help moving into permanent housing should have leases that confer the full rights, responsibilities, and legal protections under Federal, state, and local housing laws. For transitional housing, there may be limitations on length of stay, but a lease/occupancy agreement should look like a lease that a person would have in the normal rental market. "},"Leases",{"$f":"F47","v":"Optional notes here"},{"$f":"IF(ISERROR(INDEX($A$1:$G$79,SMALL(IF($A$1:$A$79=$I$1,ROW($A$1:$A$79)),ROW(45:45)),7)),\"\",INDEX($A$1:$G$79,SMALL(IF($A$1:$A$79=$I$1,ROW($A$1:$A$79)),ROW(45:45)),7))","v":""},{"$f":"IF(ISERROR(INDEX($A$1:$G$79,SMALL(IF($A$1:$A$79=$I$1,ROW($A$1:$A$79)),ROW(45:45)),4)),\"\",INDEX($A$1:$G$79,SMALL(IF($A$1:$A$79=$I$1,ROW($A$1:$A$79)),ROW(45:45)),4))","v":""},{"$f":"IF(ISERROR(INDEX($A$1:$G$79,SMALL(IF($A$1:$A$79=$I$1,ROW($A$1:$A$79)),ROW(45:45)),5)),\"\",INDEX($A$1:$G$79,SMALL(IF($A$1:$A$79=$I$1,ROW($A$1:$A$79)),ROW(45:45)),5))","v":""},{"$f":"IF(ISERROR(INDEX($A$1:$G$79,SMALL(IF($A$1:$A$79=$I$1,ROW($A$1:$A$79)),ROW(45:45)),6)),\"\",INDEX($A$1:$G$79,SMALL(IF($A$1:$A$79=$I$1,ROW($A$1:$A$79)),ROW(45:45)),6))","v":""},{"$f":"IF(ISERROR(INDEX($A$1:$H$79,SMALL(IF($A$1:$A$79=$I$1,ROW($A$1:$A$79)),ROW(45:45)),8)),\"\",INDEX($A$1:$H$79,SMALL(IF($A$1:$A$79=$I$1,ROW($A$1:$A$79)),ROW(45:45)),8))","v":""},{"$f":"IF(ISERROR(INDEX($A$1:$G$79,SMALL(IF($B$1:$B$79=$N$1,ROW($B$1:$B$79)),ROW(45:45)),6)),\"\",INDEX($A$1:$G$79,SMALL(IF($B$1:$B$79=$N$1,ROW($B$1:$B$79)),ROW(45:45)),6))","v":""},{"$f":"IF(ISERROR(INDEX($A$1:$G$79,SMALL(IF($B$1:$B$79=$N$1,ROW($B$1:$B$79)),ROW(45:45)),4)),\"\",INDEX($A$1:$G$79,SMALL(IF($B$1:$B$79=$N$1,ROW($B$1:$B$79)),ROW(45:45)),4))","v":""},{"$f":"IF(ISERROR(INDEX($A$1:$G$79,SMALL(IF($B$1:$B$79=$N$1,ROW($B$1:$B$79)),ROW(45:45)),5)),\"\",INDEX($A$1:$G$79,SMALL(IF($B$1:$B$79=$N$1,ROW($B$1:$B$79)),ROW(45:45)),5))","v":""},{"$f":"IF(ISERROR(INDEX($A$1:$G$79,SMALL(IF($B$1:$B$79=$N$1,ROW($B$1:$B$79)),ROW(45:45)),7)),\"\",INDEX($A$1:$G$79,SMALL(IF($B$1:$B$79=$N$1,ROW($B$1:$B$79)),ROW(45:45)),7))","v":""},{"$f":"IF(ISERROR(INDEX($A$1:$H$79,SMALL(IF($B$1:$B$79=$N$1,ROW($B$1:$B$79)),ROW(45:45)),8)),\"\",INDEX($A$1:$H$79,SMALL(IF($B$1:$B$79=$N$1,ROW($B$1:$B$79)),ROW(45:45)),8))","v":""},{"$f":"IF(ISERROR(INDEX($A$1:$G$79,SMALL(IF($C$1:$C$79=$S$1,ROW($C$1:$C$79)),ROW(45:45)),6)),\"\",INDEX($A$1:$G$79,SMALL(IF($C$1:$C$79=$S$1,ROW($C$1:$C$79)),ROW(45:45)),6))","v":""},{"$f":"IF(ISERROR(INDEX($A$1:$G$79,SMALL(IF($C$1:$C$79=$S$1,ROW($C$1:$C$79)),ROW(45:45)),4)),\"\",INDEX($A$1:$G$79,SMALL(IF($C$1:$C$79=$S$1,ROW($C$1:$C$79)),ROW(45:45)),4))","v":""},{"$f":"IF(ISERROR(INDEX($A$1:$G$79,SMALL(IF($C$1:$C$79=$S$1,ROW($C$1:$C$79)),ROW(45:45)),5)),\"\",INDEX($A$1:$G$79,SMALL(IF($C$1:$C$79=$S$1,ROW($C$1:$C$79)),ROW(45:45)),5))","v":""},{"$f":"IF(ISERROR(INDEX($A$1:$G$79,SMALL(IF($C$1:$C$79=$S$1,ROW($C$1:$C$79)),ROW(45:45)),7)),\"\",INDEX($A$1:$G$79,SMALL(IF($C$1:$C$79=$S$1,ROW($C$1:$C$79)),ROW(45:45)),7))","v":""},{"$f":"IF(ISERROR(INDEX($A$1:$H$79,SMALL(IF($C$1:$C$79=$S$1,ROW($C$1:$C$79)),ROW(45:45)),8)),\"\",INDEX($A$1:$H$79,SMALL(IF($C$1:$C$79=$S$1,ROW($C$1:$C$79)),ROW(45:45)),8))","v":""}," "]
[{"$f":"Leases!F12","v":0},{"$f":"Leases!G12","v":0},{"$f":"Leases!H12","v":0},{"$f":"Leases!B12","v":0},{"$f":"Leases!C12","v":0},{"$f":"Leases!D12","v":"Optional notes here"},"Leases",0,{"$f":"IF(ISERROR(INDEX($A$1:$G$79,SMALL(IF($A$1:$A$79=$I$1,ROW($A$1:$A$79)),ROW(46:46)),7)),\"\",INDEX($A$1:$G$79,SMALL(IF($A$1:$A$79=$I$1,ROW($A$1:$A$79)),ROW(46:46)),7))","v":""},{"$f":"IF(ISERROR(INDEX($A$1:$G$79,SMALL(IF($A$1:$A$79=$I$1,ROW($A$1:$A$79)),ROW(46:46)),4)),\"\",INDEX($A$1:$G$79,SMALL(IF($A$1:$A$79=$I$1,ROW($A$1:$A$79)),ROW(46:46)),4))","v":""},{"$f":"IF(ISERROR(INDEX($A$1:$G$79,SMALL(IF($A$1:$A$79=$I$1,ROW($A$1:$A$79)),ROW(46:46)),5)),\"\",INDEX($A$1:$G$79,SMALL(IF($A$1:$A$79=$I$1,ROW($A$1:$A$79)),ROW(46:46)),5))","v":""},{"$f":"IF(ISERROR(INDEX($A$1:$G$79,SMALL(IF($A$1:$A$79=$I$1,ROW($A$1:$A$79)),ROW(46:46)),6)),\"\",INDEX($A$1:$G$79,SMALL(IF($A$1:$A$79=$I$1,ROW($A$1:$A$79)),ROW(46:46)),6))","v":""},{"$f":"IF(ISERROR(INDEX($A$1:$H$79,SMALL(IF($A$1:$A$79=$I$1,ROW($A$1:$A$79)),ROW(46:46)),8)),\"\",INDEX($A$1:$H$79,SMALL(IF($A$1:$A$79=$I$1,ROW($A$1:$A$79)),ROW(46:46)),8))","v":""},{"$f":"IF(ISERROR(INDEX($A$1:$G$79,SMALL(IF($B$1:$B$79=$N$1,ROW($B$1:$B$79)),ROW(46:46)),6)),\"\",INDEX($A$1:$G$79,SMALL(IF($B$1:$B$79=$N$1,ROW($B$1:$B$79)),ROW(46:46)),6))","v":""},{"$f":"IF(ISERROR(INDEX($A$1:$G$79,SMALL(IF($B$1:$B$79=$N$1,ROW($B$1:$B$79)),ROW(46:46)),4)),\"\",INDEX($A$1:$G$79,SMALL(IF($B$1:$B$79=$N$1,ROW($B$1:$B$79)),ROW(46:46)),4))","v":""},{"$f":"IF(ISERROR(INDEX($A$1:$G$79,SMALL(IF($B$1:$B$79=$N$1,ROW($B$1:$B$79)),ROW(46:46)),5)),\"\",INDEX($A$1:$G$79,SMALL(IF($B$1:$B$79=$N$1,ROW($B$1:$B$79)),ROW(46:46)),5))","v":""},{"$f":"IF(ISERROR(INDEX($A$1:$G$79,SMALL(IF($B$1:$B$79=$N$1,ROW($B$1:$B$79)),ROW(46:46)),7)),\"\",INDEX($A$1:$G$79,SMALL(IF($B$1:$B$79=$N$1,ROW($B$1:$B$79)),ROW(46:46)),7))","v":""},{"$f":"IF(ISERROR(INDEX($A$1:$H$79,SMALL(IF($B$1:$B$79=$N$1,ROW($B$1:$B$79)),ROW(46:46)),8)),\"\",INDEX($A$1:$H$79,SMALL(IF($B$1:$B$79=$N$1,ROW($B$1:$B$79)),ROW(46:46)),8))","v":""},{"$f":"IF(ISERROR(INDEX($A$1:$G$79,SMALL(IF($C$1:$C$79=$S$1,ROW($C$1:$C$79)),ROW(46:46)),6)),\"\",INDEX($A$1:$G$79,SMALL(IF($C$1:$C$79=$S$1,ROW($C$1:$C$79)),ROW(46:46)),6))","v":""},{"$f":"IF(ISERROR(INDEX($A$1:$G$79,SMALL(IF($C$1:$C$79=$S$1,ROW($C$1:$C$79)),ROW(46:46)),4)),\"\",INDEX($A$1:$G$79,SMALL(IF($C$1:$C$79=$S$1,ROW($C$1:$C$79)),ROW(46:46)),4))","v":""},{"$f":"IF(ISERROR(INDEX($A$1:$G$79,SMALL(IF($C$1:$C$79=$S$1,ROW($C$1:$C$79)),ROW(46:46)),5)),\"\",INDEX($A$1:$G$79,SMALL(IF($C$1:$C$79=$S$1,ROW($C$1:$C$79)),ROW(46:46)),5))","v":""},{"$f":"IF(ISERROR(INDEX($A$1:$G$79,SMALL(IF($C$1:$C$79=$S$1,ROW($C$1:$C$79)),ROW(46:46)),7)),\"\",INDEX($A$1:$G$79,SMALL(IF($C$1:$C$79=$S$1,ROW($C$1:$C$79)),ROW(46:46)),7))","v":""},{"$f":"IF(ISERROR(INDEX($A$1:$H$79,SMALL(IF($C$1:$C$79=$S$1,ROW($C$1:$C$79)),ROW(46:46)),8)),\"\",INDEX($A$1:$H$79,SMALL(IF($C$1:$C$79=$S$1,ROW($C$1:$C$79)),ROW(46:46)),8))","v":""}," "]
[{"$f":"Leases!F13","v":"Please select answer"},{"$f":"Leases!G13","v":"Please select answer"},{"$f":"Leases!H13","v":"Please select answer"},{"$f":"Leases!B13","v":4},{"$f":"Leases!C13","v":"Participants receive education about their lease or occupancy agreement terms"},{"$f":"Leases!D13","v":"Participants are also given access to legal assistance and encouraged to exercise their full legal rights and responsibilities. Landlords and providers abide by their legally-defined roles and responsibilities."},"Leases",{"$f":"F49","v":"Optional notes here"},{"$f":"IF(ISERROR(INDEX($A$1:$G$79,SMALL(IF($A$1:$A$79=$I$1,ROW($A$1:$A$79)),ROW(47:47)),7)),\"\",INDEX($A$1:$G$79,SMALL(IF($A$1:$A$79=$I$1,ROW($A$1:$A$79)),ROW(47:47)),7))","v":""},{"$f":"IF(ISERROR(INDEX($A$1:$G$79,SMALL(IF($A$1:$A$79=$I$1,ROW($A$1:$A$79)),ROW(47:47)),4)),\"\",INDEX($A$1:$G$79,SMALL(IF($A$1:$A$79=$I$1,ROW($A$1:$A$79)),ROW(47:47)),4))","v":""},{"$f":"IF(ISERROR(INDEX($A$1:$G$79,SMALL(IF($A$1:$A$79=$I$1,ROW($A$1:$A$79)),ROW(47:47)),5)),\"\",INDEX($A$1:$G$79,SMALL(IF($A$1:$A$79=$I$1,ROW($A$1:$A$79)),ROW(47:47)),5))","v":""},{"$f":"IF(ISERROR(INDEX($A$1:$G$79,SMALL(IF($A$1:$A$79=$I$1,ROW($A$1:$A$79)),ROW(47:47)),6)),\"\",INDEX($A$1:$G$79,SMALL(IF($A$1:$A$79=$I$1,ROW($A$1:$A$79)),ROW(47:47)),6))","v":""},{"$f":"IF(ISERROR(INDEX($A$1:$H$79,SMALL(IF($A$1:$A$79=$I$1,ROW($A$1:$A$79)),ROW(47:47)),8)),\"\",INDEX($A$1:$H$79,SMALL(IF($A$1:$A$79=$I$1,ROW($A$1:$A$79)),ROW(47:47)),8))","v":""},{"$f":"IF(ISERROR(INDEX($A$1:$G$79,SMALL(IF($B$1:$B$79=$N$1,ROW($B$1:$B$79)),ROW(47:47)),6)),\"\",INDEX($A$1:$G$79,SMALL(IF($B$1:$B$79=$N$1,ROW($B$1:$B$79)),ROW(47:47)),6))","v":""},{"$f":"IF(ISERROR(INDEX($A$1:$G$79,SMALL(IF($B$1:$B$79=$N$1,ROW($B$1:$B$79)),ROW(47:47)),4)),\"\",INDEX($A$1:$G$79,SMALL(IF($B$1:$B$79=$N$1,ROW($B$1:$B$79)),ROW(47:47)),4))","v":""},{"$f":"IF(ISERROR(INDEX($A$1:$G$79,SMALL(IF($B$1:$B$79=$N$1,ROW($B$1:$B$79)),ROW(47:47)),5)),\"\",INDEX($A$1:$G$79,SMALL(IF($B$1:$B$79=$N$1,ROW($B$1:$B$79)),ROW(47:47)),5))","v":""},{"$f":"IF(ISERROR(INDEX($A$1:$G$79,SMALL(IF($B$1:$B$79=$N$1,ROW($B$1:$B$79)),ROW(47:47)),7)),\"\",INDEX($A$1:$G$79,SMALL(IF($B$1:$B$79=$N$1,ROW($B$1:$B$79)),ROW(47:47)),7))","v":""},{"$f":"IF(ISERROR(INDEX($A$1:$H$79,SMALL(IF($B$1:$B$79=$N$1,ROW($B$1:$B$79)),ROW(47:47)),8)),\"\",INDEX($A$1:$H$79,SMALL(IF($B$1:$B$79=$N$1,ROW($B$1:$B$79)),ROW(47:47)),8))","v":""},{"$f":"IF(ISERROR(INDEX($A$1:$G$79,SMALL(IF($C$1:$C$79=$S$1,ROW($C$1:$C$79)),ROW(47:47)),6)),\"\",INDEX($A$1:$G$79,SMALL(IF($C$1:$C$79=$S$1,ROW($C$1:$C$79)),ROW(47:47)),6))","v":""},{"$f":"IF(ISERROR(INDEX($A$1:$G$79,SMALL(IF($C$1:$C$79=$S$1,ROW($C$1:$C$79)),ROW(47:47)),4)),\"\",INDEX($A$1:$G$79,SMALL(IF($C$1:$C$79=$S$1,ROW($C$1:$C$79)),ROW(47:47)),4))","v":""},{"$f":"IF(ISERROR(INDEX($A$1:$G$79,SMALL(IF($C$1:$C$79=$S$1,ROW($C$1:$C$79)),ROW(47:47)),5)),\"\",INDEX($A$1:$G$79,SMALL(IF($C$1:$C$79=$S$1,ROW($C$1:$C$79)),ROW(47:47)),5))","v":""},{"$f":"IF(ISERROR(INDEX($A$1:$G$79,SMALL(IF($C$1:$C$79=$S$1,ROW($C$1:$C$79)),ROW(47:47)),7)),\"\",INDEX($A$1:$G$79,SMALL(IF($C$1:$C$79=$S$1,ROW($C$1:$C$79)),ROW(47:47)),7))","v":""},{"$f":"IF(ISERROR(INDEX($A$1:$H$79,SMALL(IF($C$1:$C$79=$S$1,ROW($C$1:$C$79)),ROW(47:47)),8)),\"\",INDEX($A$1:$H$79,SMALL(IF($C$1:$C$79=$S$1,ROW($C$1:$C$79)),ROW(47:47)),8))","v":""}," "]
[{"$f":"Leases!F14","v":0},{"$f":"Leases!G14","v":0},{"$f":"Leases!H14","v":0},{"$f":"Leases!B14","v":0},{"$f":"Leases!C14","v":0},{"$f":"Leases!D14","v":"Optional notes here"},"Leases",0,{"$f":"IF(ISERROR(INDEX($A$1:$G$79,SMALL(IF($A$1:$A$79=$I$1,ROW($A$1:$A$79)),ROW(48:48)),7)),\"\",INDEX($A$1:$G$79,SMALL(IF($A$1:$A$79=$I$1,ROW($A$1:$A$79)),ROW(48:48)),7))","v":""},{"$f":"IF(ISERROR(INDEX($A$1:$G$79,SMALL(IF($A$1:$A$79=$I$1,ROW($A$1:$A$79)),ROW(48:48)),4)),\"\",INDEX($A$1:$G$79,SMALL(IF($A$1:$A$79=$I$1,ROW($A$1:$A$79)),ROW(48:48)),4))","v":""},{"$f":"IF(ISERROR(INDEX($A$1:$G$79,SMALL(IF($A$1:$A$79=$I$1,ROW($A$1:$A$79)),ROW(48:48)),5)),\"\",INDEX($A$1:$G$79,SMALL(IF($A$1:$A$79=$I$1,ROW($A$1:$A$79)),ROW(48:48)),5))","v":""},{"$f":"IF(ISERROR(INDEX($A$1:$G$79,SMALL(IF($A$1:$A$79=$I$1,ROW($A$1:$A$79)),ROW(48:48)),6)),\"\",INDEX($A$1:$G$79,SMALL(IF($A$1:$A$79=$I$1,ROW($A$1:$A$79)),ROW(48:48)),6))","v":""},{"$f":"IF(ISERROR(INDEX($A$1:$H$79,SMALL(IF($A$1:$A$79=$I$1,ROW($A$1:$A$79)),ROW(48:48)),8)),\"\",INDEX($A$1:$H$79,SMALL(IF($A$1:$A$79=$I$1,ROW($A$1:$A$79)),ROW(48:48)),8))","v":""},{"$f":"IF(ISERROR(INDEX($A$1:$G$79,SMALL(IF($B$1:$B$79=$N$1,ROW($B$1:$B$79)),ROW(48:48)),6)),\"\",INDEX($A$1:$G$79,SMALL(IF($B$1:$B$79=$N$1,ROW($B$1:$B$79)),ROW(48:48)),6))","v":""},{"$f":"IF(ISERROR(INDEX($A$1:$G$79,SMALL(IF($B$1:$B$79=$N$1,ROW($B$1:$B$79)),ROW(48:48)),4)),\"\",INDEX($A$1:$G$79,SMALL(IF($B$1:$B$79=$N$1,ROW($B$1:$B$79)),ROW(48:48)),4))","v":""},{"$f":"IF(ISERROR(INDEX($A$1:$G$79,SMALL(IF($B$1:$B$79=$N$1,ROW($B$1:$B$79)),ROW(48:48)),5)),\"\",INDEX($A$1:$G$79,SMALL(IF($B$1:$B$79=$N$1,ROW($B$1:$B$79)),ROW(48:48)),5))","v":""},{"$f":"IF(ISERROR(INDEX($A$1:$G$79,SMALL(IF($B$1:$B$79=$N$1,ROW($B$1:$B$79)),ROW(48:48)),7)),\"\",INDEX($A$1:$G$79,SMALL(IF($B$1:$B$79=$N$1,ROW($B$1:$B$79)),ROW(48:48)),7))","v":""},{"$f":"IF(ISERROR(INDEX($A$1:$H$79,SMALL(IF($B$1:$B$79=$N$1,ROW($B$1:$B$79)),ROW(48:48)),8)),\"\",INDEX($A$1:$H$79,SMALL(IF($B$1:$B$79=$N$1,ROW($B$1:$B$79)),ROW(48:48)),8))","v":""},{"$f":"IF(ISERROR(INDEX($A$1:$G$79,SMALL(IF($C$1:$C$79=$S$1,ROW($C$1:$C$79)),ROW(48:48)),6)),\"\",INDEX($A$1:$G$79,SMALL(IF($C$1:$C$79=$S$1,ROW($C$1:$C$79)),ROW(48:48)),6))","v":""},{"$f":"IF(ISERROR(INDEX($A$1:$G$79,SMALL(IF($C$1:$C$79=$S$1,ROW($C$1:$C$79)),ROW(48:48)),4)),\"\",INDEX($A$1:$G$79,SMALL(IF($C$1:$C$79=$S$1,ROW($C$1:$C$79)),ROW(48:48)),4))","v":""},{"$f":"IF(ISERROR(INDEX($A$1:$G$79,SMALL(IF($C$1:$C$79=$S$1,ROW($C$1:$C$79)),ROW(48:48)),5)),\"\",INDEX($A$1:$G$79,SMALL(IF($C$1:$C$79=$S$1,ROW($C$1:$C$79)),ROW(48:48)),5))","v":""},{"$f":"IF(ISERROR(INDEX($A$1:$G$79,SMALL(IF($C$1:$C$79=$S$1,ROW($C$1:$C$79)),ROW(48:48)),7)),\"\",INDEX($A$1:$G$79,SMALL(IF($C$1:$C$79=$S$1,ROW($C$1:$C$79)),ROW(48:48)),7))","v":""},{"$f":"IF(ISERROR(INDEX($A$1:$H$79,SMALL(IF($C$1:$C$79=$S$1,ROW($C$1:$C$79)),ROW(48:48)),8)),\"\",INDEX($A$1:$H$79,SMALL(IF($C$1:$C$79=$S$1,ROW($C$1:$C$79)),ROW(48:48)),8))","v":""}," "]
[{"$f":"Leases!F15","v":"Please select answer"},{"$f":"Leases!G15","v":"Please select answer"},{"$f":"Leases!H15","v":"Please select answer"},{"$f":"Leases!B15","v":5},{"$f":"Leases!C15","v":"Measures are used to prevent eviction"},{"$f":"Leases!D15","v":"Property or building management, with services support, incorporates a culture of eviction avoidance, reinforced through practices and policies that prevent lease violations and evictions among participants, and evict participants only when they are a threat to self or others. Clear eviction appeal processes and due process is provided for all participants. Lease bifurcation is allowed so that a tenant or lawful occupant who is a victim of a criminal act of physical violence committed against them by another tenant or lawful occupant is not evicted, removed or penalized if the other is evicted. "},"Leases",{"$f":"F51","v":"Optional notes here"},{"$f":"IF(ISERROR(INDEX($A$1:$G$79,SMALL(IF($A$1:$A$79=$I$1,ROW($A$1:$A$79)),ROW(49:49)),7)),\"\",INDEX($A$1:$G$79,SMALL(IF($A$1:$A$79=$I$1,ROW($A$1:$A$79)),ROW(49:49)),7))","v":""},{"$f":"IF(ISERROR(INDEX($A$1:$G$79,SMALL(IF($A$1:$A$79=$I$1,ROW($A$1:$A$79)),ROW(49:49)),4)),\"\",INDEX($A$1:$G$79,SMALL(IF($A$1:$A$79=$I$1,ROW($A$1:$A$79)),ROW(49:49)),4))","v":""},{"$f":"IF(ISERROR(INDEX($A$1:$G$79,SMALL(IF($A$1:$A$79=$I$1,ROW($A$1:$A$79)),ROW(49:49)),5)),\"\",INDEX($A$1:$G$79,SMALL(IF($A$1:$A$79=$I$1,ROW($A$1:$A$79)),ROW(49:49)),5))","v":""},{"$f":"IF(ISERROR(INDEX($A$1:$G$79,SMALL(IF($A$1:$A$79=$I$1,ROW($A$1:$A$79)),ROW(49:49)),6)),\"\",INDEX($A$1:$G$79,SMALL(IF($A$1:$A$79=$I$1,ROW($A$1:$A$79)),ROW(49:49)),6))","v":""},{"$f":"IF(ISERROR(INDEX($A$1:$H$79,SMALL(IF($A$1:$A$79=$I$1,ROW($A$1:$A$79)),ROW(49:49)),8)),\"\",INDEX($A$1:$H$79,SMALL(IF($A$1:$A$79=$I$1,ROW($A$1:$A$79)),ROW(49:49)),8))","v":""},{"$f":"IF(ISERROR(INDEX($A$1:$G$79,SMALL(IF($B$1:$B$79=$N$1,ROW($B$1:$B$79)),ROW(49:49)),6)),\"\",INDEX($A$1:$G$79,SMALL(IF($B$1:$B$79=$N$1,ROW($B$1:$B$79)),ROW(49:49)),6))","v":""},{"$f":"IF(ISERROR(INDEX($A$1:$G$79,SMALL(IF($B$1:$B$79=$N$1,ROW($B$1:$B$79)),ROW(49:49)),4)),\"\",INDEX($A$1:$G$79,SMALL(IF($B$1:$B$79=$N$1,ROW($B$1:$B$79)),ROW(49:49)),4))","v":""},{"$f":"IF(ISERROR(INDEX($A$1:$G$79,SMALL(IF($B$1:$B$79=$N$1,ROW($B$1:$B$79)),ROW(49:49)),5)),\"\",INDEX($A$1:$G$79,SMALL(IF($B$1:$B$79=$N$1,ROW($B$1:$B$79)),ROW(49:49)),5))","v":""},{"$f":"IF(ISERROR(INDEX($A$1:$G$79,SMALL(IF($B$1:$B$79=$N$1,ROW($B$1:$B$79)),ROW(49:49)),7)),\"\",INDEX($A$1:$G$79,SMALL(IF($B$1:$B$79=$N$1,ROW($B$1:$B$79)),ROW(49:49)),7))","v":""},{"$f":"IF(ISERROR(INDEX($A$1:$H$79,SMALL(IF($B$1:$B$79=$N$1,ROW($B$1:$B$79)),ROW(49:49)),8)),\"\",INDEX($A$1:$H$79,SMALL(IF($B$1:$B$79=$N$1,ROW($B$1:$B$79)),ROW(49:49)),8))","v":""},{"$f":"IF(ISERROR(INDEX($A$1:$G$79,SMALL(IF($C$1:$C$79=$S$1,ROW($C$1:$C$79)),ROW(49:49)),6)),\"\",INDEX($A$1:$G$79,SMALL(IF($C$1:$C$79=$S$1,ROW($C$1:$C$79)),ROW(49:49)),6))","v":""},{"$f":"IF(ISERROR(INDEX($A$1:$G$79,SMALL(IF($C$1:$C$79=$S$1,ROW($C$1:$C$79)),ROW(49:49)),4)),\"\",INDEX($A$1:$G$79,SMALL(IF($C$1:$C$79=$S$1,ROW($C$1:$C$79)),ROW(49:49)),4))","v":""},{"$f":"IF(ISERROR(INDEX($A$1:$G$79,SMALL(IF($C$1:$C$79=$S$1,ROW($C$1:$C$79)),ROW(49:49)),5)),\"\",INDEX($A$1:$G$79,SMALL(IF($C$1:$C$79=$S$1,ROW($C$1:$C$79)),ROW(49:49)),5))","v":""},{"$f":"IF(ISERROR(INDEX($A$1:$G$79,SMALL(IF($C$1:$C$79=$S$1,ROW($C$1:$C$79)),ROW(49:49)),7)),\"\",INDEX($A$1:$G$79,SMALL(IF($C$1:$C$79=$S$1,ROW($C$1:$C$79)),ROW(49:49)),7))","v":""},{"$f":"IF(ISERROR(INDEX($A$1:$H$79,SMALL(IF($C$1:$C$79=$S$1,ROW($C$1:$C$79)),ROW(49:49)),8)),\"\",INDEX($A$1:$H$79,SMALL(IF($C$1:$C$79=$S$1,ROW($C$1:$C$79)),ROW(49:49)),8))","v":""}," "]
[{"$f":"Leases!F16","v":0},{"$f":"Leases!G16","v":0},{"$f":"Leases!H16","v":0},{"$f":"Leases!B16","v":0},{"$f":"Leases!C16","v":0},{"$f":"Leases!D16","v":"Optional notes here"},"Leases",0,{"$f":"IF(ISERROR(INDEX($A$1:$G$79,SMALL(IF($A$1:$A$79=$I$1,ROW($A$1:$A$79)),ROW(50:50)),7)),\"\",INDEX($A$1:$G$79,SMALL(IF($A$1:$A$79=$I$1,ROW($A$1:$A$79)),ROW(50:50)),7))","v":""},{"$f":"IF(ISERROR(INDEX($A$1:$G$79,SMALL(IF($A$1:$A$79=$I$1,ROW($A$1:$A$79)),ROW(50:50)),4)),\"\",INDEX($A$1:$G$79,SMALL(IF($A$1:$A$79=$I$1,ROW($A$1:$A$79)),ROW(50:50)),4))","v":""},{"$f":"IF(ISERROR(INDEX($A$1:$G$79,SMALL(IF($A$1:$A$79=$I$1,ROW($A$1:$A$79)),ROW(50:50)),5)),\"\",INDEX($A$1:$G$79,SMALL(IF($A$1:$A$79=$I$1,ROW($A$1:$A$79)),ROW(50:50)),5))","v":""},{"$f":"IF(ISERROR(INDEX($A$1:$G$79,SMALL(IF($A$1:$A$79=$I$1,ROW($A$1:$A$79)),ROW(50:50)),6)),\"\",INDEX($A$1:$G$79,SMALL(IF($A$1:$A$79=$I$1,ROW($A$1:$A$79)),ROW(50:50)),6))","v":""},{"$f":"IF(ISERROR(INDEX($A$1:$H$79,SMALL(IF($A$1:$A$79=$I$1,ROW($A$1:$A$79)),ROW(50:50)),8)),\"\",INDEX($A$1:$H$79,SMALL(IF($A$1:$A$79=$I$1,ROW($A$1:$A$79)),ROW(50:50)),8))","v":""},{"$f":"IF(ISERROR(INDEX($A$1:$G$79,SMALL(IF($B$1:$B$79=$N$1,ROW($B$1:$B$79)),ROW(50:50)),6)),\"\",INDEX($A$1:$G$79,SMALL(IF($B$1:$B$79=$N$1,ROW($B$1:$B$79)),ROW(50:50)),6))","v":""},{"$f":"IF(ISERROR(INDEX($A$1:$G$79,SMALL(IF($B$1:$B$79=$N$1,ROW($B$1:$B$79)),ROW(50:50)),4)),\"\",INDEX($A$1:$G$79,SMALL(IF($B$1:$B$79=$N$1,ROW($B$1:$B$79)),ROW(50:50)),4))","v":""},{"$f":"IF(ISERROR(INDEX($A$1:$G$79,SMALL(IF($B$1:$B$79=$N$1,ROW($B$1:$B$79)),ROW(50:50)),5)),\"\",INDEX($A$1:$G$79,SMALL(IF($B$1:$B$79=$N$1,ROW($B$1:$B$79)),ROW(50:50)),5))","v":""},{"$f":"IF(ISERROR(INDEX($A$1:$G$79,SMALL(IF($B$1:$B$79=$N$1,ROW($B$1:$B$79)),ROW(50:50)),7)),\"\",INDEX($A$1:$G$79,SMALL(IF($B$1:$B$79=$N$1,ROW($B$1:$B$79)),ROW(50:50)),7))","v":""},{"$f":"IF(ISERROR(INDEX($A$1:$H$79,SMALL(IF($B$1:$B$79=$N$1,ROW($B$1:$B$79)),ROW(50:50)),8)),\"\",INDEX($A$1:$H$79,SMALL(IF($B$1:$B$79=$N$1,ROW($B$1:$B$79)),ROW(50:50)),8))","v":""},{"$f":"IF(ISERROR(INDEX($A$1:$G$79,SMALL(IF($C$1:$C$79=$S$1,ROW($C$1:$C$79)),ROW(50:50)),6)),\"\",INDEX($A$1:$G$79,SMALL(IF($C$1:$C$79=$S$1,ROW($C$1:$C$79)),ROW(50:50)),6))","v":""},{"$f":"IF(ISERROR(INDEX($A$1:$G$79,SMALL(IF($C$1:$C$79=$S$1,ROW($C$1:$C$79)),ROW(50:50)),4)),\"\",INDEX($A$1:$G$79,SMALL(IF($C$1:$C$79=$S$1,ROW($C$1:$C$79)),ROW(50:50)),4))","v":""},{"$f":"IF(ISERROR(INDEX($A$1:$G$79,SMALL(IF($C$1:$C$79=$S$1,ROW($C$1:$C$79)),ROW(50:50)),5)),\"\",INDEX($A$1:$G$79,SMALL(IF($C$1:$C$79=$S$1,ROW($C$1:$C$79)),ROW(50:50)),5))","v":""},{"$f":"IF(ISERROR(INDEX($A$1:$G$79,SMALL(IF($C$1:$C$79=$S$1,ROW($C$1:$C$79)),ROW(50:50)),7)),\"\",INDEX($A$1:$G$79,SMALL(IF($C$1:$C$79=$S$1,ROW($C$1:$C$79)),ROW(50:50)),7))","v":""},{"$f":"IF(ISERROR(INDEX($A$1:$H$79,SMALL(IF($C$1:$C$79=$S$1,ROW($C$1:$C$79)),ROW(50:50)),8)),\"\",INDEX($A$1:$H$79,SMALL(IF($C$1:$C$79=$S$1,ROW($C$1:$C$79)),ROW(50:50)),8))","v":""}," "]
[{"$f":"Leases!F17","v":"Please select answer"},{"$f":"Leases!G17","v":"Please select answer"},{"$f":"Leases!H17","v":"Please select answer"},{"$f":"Leases!B17","v":6},{"$f":"Leases!C17","v":"Providing stable housing is a priority"},{"$f":"Leases!D17","v":"Providers engage in a continued effort to hold housing for participants, even if they leave their housing for short periods due to treatment, illness, or any other temporary stay outside of the unit.  "},"Leases",{"$f":"F53","v":"Optional notes here"},{"$f":"IF(ISERROR(INDEX($A$1:$G$79,SMALL(IF($A$1:$A$79=$I$1,ROW($A$1:$A$79)),ROW(51:51)),7)),\"\",INDEX($A$1:$G$79,SMALL(IF($A$1:$A$79=$I$1,ROW($A$1:$A$79)),ROW(51:51)),7))","v":""},{"$f":"IF(ISERROR(INDEX($A$1:$G$79,SMALL(IF($A$1:$A$79=$I$1,ROW($A$1:$A$79)),ROW(51:51)),4)),\"\",INDEX($A$1:$G$79,SMALL(IF($A$1:$A$79=$I$1,ROW($A$1:$A$79)),ROW(51:51)),4))","v":""},{"$f":"IF(ISERROR(INDEX($A$1:$G$79,SMALL(IF($A$1:$A$79=$I$1,ROW($A$1:$A$79)),ROW(51:51)),5)),\"\",INDEX($A$1:$G$79,SMALL(IF($A$1:$A$79=$I$1,ROW($A$1:$A$79)),ROW(51:51)),5))","v":""},{"$f":"IF(ISERROR(INDEX($A$1:$G$79,SMALL(IF($A$1:$A$79=$I$1,ROW($A$1:$A$79)),ROW(51:51)),6)),\"\",INDEX($A$1:$G$79,SMALL(IF($A$1:$A$79=$I$1,ROW($A$1:$A$79)),ROW(51:51)),6))","v":""},{"$f":"IF(ISERROR(INDEX($A$1:$H$79,SMALL(IF($A$1:$A$79=$I$1,ROW($A$1:$A$79)),ROW(51:51)),8)),\"\",INDEX($A$1:$H$79,SMALL(IF($A$1:$A$79=$I$1,ROW($A$1:$A$79)),ROW(51:51)),8))","v":""},{"$f":"IF(ISERROR(INDEX($A$1:$G$79,SMALL(IF($B$1:$B$79=$N$1,ROW($B$1:$B$79)),ROW(51:51)),6)),\"\",INDEX($A$1:$G$79,SMALL(IF($B$1:$B$79=$N$1,ROW($B$1:$B$79)),ROW(51:51)),6))","v":""},{"$f":"IF(ISERROR(INDEX($A$1:$G$79,SMALL(IF($B$1:$B$79=$N$1,ROW($B$1:$B$79)),ROW(51:51)),4)),\"\",INDEX($A$1:$G$79,SMALL(IF($B$1:$B$79=$N$1,ROW($B$1:$B$79)),ROW(51:51)),4))","v":""},{"$f":"IF(ISERROR(INDEX($A$1:$G$79,SMALL(IF($B$1:$B$79=$N$1,ROW($B$1:$B$79)),ROW(51:51)),5)),\"\",INDEX($A$1:$G$79,SMALL(IF($B$1:$B$79=$N$1,ROW($B$1:$B$79)),ROW(51:51)),5))","v":""},{"$f":"IF(ISERROR(INDEX($A$1:$G$79,SMALL(IF($B$1:$B$79=$N$1,ROW($B$1:$B$79)),ROW(51:51)),7)),\"\",INDEX($A$1:$G$79,SMALL(IF($B$1:$B$79=$N$1,ROW($B$1:$B$79)),ROW(51:51)),7))","v":""},{"$f":"IF(ISERROR(INDEX($A$1:$H$79,SMALL(IF($B$1:$B$79=$N$1,ROW($B$1:$B$79)),ROW(51:51)),8)),\"\",INDEX($A$1:$H$79,SMALL(IF($B$1:$B$79=$N$1,ROW($B$1:$B$79)),ROW(51:51)),8))","v":""},{"$f":"IF(ISERROR(INDEX($A$1:$G$79,SMALL(IF($C$1:$C$79=$S$1,ROW($C$1:$C$79)),ROW(51:51)),6)),\"\",INDEX($A$1:$G$79,SMALL(IF($C$1:$C$79=$S$1,ROW($C$1:$C$79)),ROW(51:51)),6))","v":""},{"$f":"IF(ISERROR(INDEX($A$1:$G$79,SMALL(IF($C$1:$C$79=$S$1,ROW($C$1:$C$79)),ROW(51:51)),4)),\"\",INDEX($A$1:$G$79,SMALL(IF($C$1:$C$79=$S$1,ROW($C$1:$C$79)),ROW(51:51)),4))","v":""},{"$f":"IF(ISERROR(INDEX($A$1:$G$79,SMALL(IF($C$1:$C$79=$S$1,ROW($C$1:$C$79)),ROW(51:51)),5)),\"\",INDEX($A$1:$G$79,SMALL(IF($C$1:$C$79=$S$1,ROW($C$1:$C$79)),ROW(51:51)),5))","v":""},{"$f":"IF(ISERROR(INDEX($A$1:$G$79,SMALL(IF($C$1:$C$79=$S$1,ROW($C$1:$C$79)),ROW(51:51)),7)),\"\",INDEX($A$1:$G$79,SMALL(IF($C$1:$C$79=$S$1,ROW($C$1:$C$79)),ROW(51:51)),7))","v":""},{"$f":"IF(ISERROR(INDEX($A$1:$H$79,SMALL(IF($C$1:$C$79=$S$1,ROW($C$1:$C$79)),ROW(51:51)),8)),\"\",INDEX($A$1:$H$79,SMALL(IF($C$1:$C$79=$S$1,ROW($C$1:$C$79)),ROW(51:51)),8))","v":""}," "]
[{"$f":"Leases!F18","v":0},{"$f":"Leases!G18","v":0},{"$f":"Leases!H18","v":0},{"$f":"Leases!B18","v":0},{"$f":"Leases!C18","v":0},{"$f":"Leases!D18","v":"Optional notes here"},"Leases",0,{"$f":"IF(ISERROR(INDEX($A$1:$G$79,SMALL(IF($A$1:$A$79=$I$1,ROW($A$1:$A$79)),ROW(52:52)),7)),\"\",INDEX($A$1:$G$79,SMALL(IF($A$1:$A$79=$I$1,ROW($A$1:$A$79)),ROW(52:52)),7))","v":""},{"$f":"IF(ISERROR(INDEX($A$1:$G$79,SMALL(IF($A$1:$A$79=$I$1,ROW($A$1:$A$79)),ROW(52:52)),4)),\"\",INDEX($A$1:$G$79,SMALL(IF($A$1:$A$79=$I$1,ROW($A$1:$A$79)),ROW(52:52)),4))","v":""},{"$f":"IF(ISERROR(INDEX($A$1:$G$79,SMALL(IF($A$1:$A$79=$I$1,ROW($A$1:$A$79)),ROW(52:52)),5)),\"\",INDEX($A$1:$G$79,SMALL(IF($A$1:$A$79=$I$1,ROW($A$1:$A$79)),ROW(52:52)),5))","v":""},{"$f":"IF(ISERROR(INDEX($A$1:$G$79,SMALL(IF($A$1:$A$79=$I$1,ROW($A$1:$A$79)),ROW(52:52)),6)),\"\",INDEX($A$1:$G$79,SMALL(IF($A$1:$A$79=$I$1,ROW($A$1:$A$79)),ROW(52:52)),6))","v":""},{"$f":"IF(ISERROR(INDEX($A$1:$H$79,SMALL(IF($A$1:$A$79=$I$1,ROW($A$1:$A$79)),ROW(52:52)),8)),\"\",INDEX($A$1:$H$79,SMALL(IF($A$1:$A$79=$I$1,ROW($A$1:$A$79)),ROW(52:52)),8))","v":""},{"$f":"IF(ISERROR(INDEX($A$1:$G$79,SMALL(IF($B$1:$B$79=$N$1,ROW($B$1:$B$79)),ROW(52:52)),6)),\"\",INDEX($A$1:$G$79,SMALL(IF($B$1:$B$79=$N$1,ROW($B$1:$B$79)),ROW(52:52)),6))","v":""},{"$f":"IF(ISERROR(INDEX($A$1:$G$79,SMALL(IF($B$1:$B$79=$N$1,ROW($B$1:$B$79)),ROW(52:52)),4)),\"\",INDEX($A$1:$G$79,SMALL(IF($B$1:$B$79=$N$1,ROW($B$1:$B$79)),ROW(52:52)),4))","v":""},{"$f":"IF(ISERROR(INDEX($A$1:$G$79,SMALL(IF($B$1:$B$79=$N$1,ROW($B$1:$B$79)),ROW(52:52)),5)),\"\",INDEX($A$1:$G$79,SMALL(IF($B$1:$B$79=$N$1,ROW($B$1:$B$79)),ROW(52:52)),5))","v":""},{"$f":"IF(ISERROR(INDEX($A$1:$G$79,SMALL(IF($B$1:$B$79=$N$1,ROW($B$1:$B$79)),ROW(52:52)),7)),\"\",INDEX($A$1:$G$79,SMALL(IF($B$1:$B$79=$N$1,ROW($B$1:$B$79)),ROW(52:52)),7))","v":""},{"$f":"IF(ISERROR(INDEX($A$1:$H$79,SMALL(IF($B$1:$B$79=$N$1,ROW($B$1:$B$79)),ROW(52:52)),8)),\"\",INDEX($A$1:$H$79,SMALL(IF($B$1:$B$79=$N$1,ROW($B$1:$B$79)),ROW(52:52)),8))","v":""},{"$f":"IF(ISERROR(INDEX($A$1:$G$79,SMALL(IF($C$1:$C$79=$S$1,ROW($C$1:$C$79)),ROW(52:52)),6)),\"\",INDEX($A$1:$G$79,SMALL(IF($C$1:$C$79=$S$1,ROW($C$1:$C$79)),ROW(52:52)),6))","v":""},{"$f":"IF(ISERROR(INDEX($A$1:$G$79,SMALL(IF($C$1:$C$79=$S$1,ROW($C$1:$C$79)),ROW(52:52)),4)),\"\",INDEX($A$1:$G$79,SMALL(IF($C$1:$C$79=$S$1,ROW($C$1:$C$79)),ROW(52:52)),4))","v":""},{"$f":"IF(ISERROR(INDEX($A$1:$G$79,SMALL(IF($C$1:$C$79=$S$1,ROW($C$1:$C$79)),ROW(52:52)),5)),\"\",INDEX($A$1:$G$79,SMALL(IF($C$1:$C$79=$S$1,ROW($C$1:$C$79)),ROW(52:52)),5))","v":""},{"$f":"IF(ISERROR(INDEX($A$1:$G$79,SMALL(IF($C$1:$C$79=$S$1,ROW($C$1:$C$79)),ROW(52:52)),7)),\"\",INDEX($A$1:$G$79,SMALL(IF($C$1:$C$79=$S$1,ROW($C$1:$C$79)),ROW(52:52)),7))","v":""},{"$f":"IF(ISERROR(INDEX($A$1:$H$79,SMALL(IF($C$1:$C$79=$S$1,ROW($C$1:$C$79)),ROW(52:52)),8)),\"\",INDEX($A$1:$H$79,SMALL(IF($C$1:$C$79=$S$1,ROW($C$1:$C$79)),ROW(52:52)),8))","v":""}," "]
[{"$f":"Leases!F19","v":"Please select answer"},{"$f":"Leases!G19","v":"Please select answer"},{"$f":"Leases!H19","v":"Please select answer"},{"$f":"Leases!B19","v":7},{"$f":"Leases!C19","v":"Rent payment policies respond to tenants’ needs (as applicable)"},{"$f":"Leases!D19","v":"While tenants are accountable to the rental agreement, adjustments may be needed on a case by case basis. As necessary, participants are given special payment arrangements for rent arrears and/or assistance with financial management, including representative payee arrangements. "},"Leases",{"$f":"F55","v":"Optional notes here"},{"$f":"IF(ISERROR(INDEX($A$1:$G$79,SMALL(IF($A$1:$A$79=$I$1,ROW($A$1:$A$79)),ROW(53:53)),7)),\"\",INDEX($A$1:$G$79,SMALL(IF($A$1:$A$79=$I$1,ROW($A$1:$A$79)),ROW(53:53)),7))","v":""},{"$f":"IF(ISERROR(INDEX($A$1:$G$79,SMALL(IF($A$1:$A$79=$I$1,ROW($A$1:$A$79)),ROW(53:53)),4)),\"\",INDEX($A$1:$G$79,SMALL(IF($A$1:$A$79=$I$1,ROW($A$1:$A$79)),ROW(53:53)),4))","v":""},{"$f":"IF(ISERROR(INDEX($A$1:$G$79,SMALL(IF($A$1:$A$79=$I$1,ROW($A$1:$A$79)),ROW(53:53)),5)),\"\",INDEX($A$1:$G$79,SMALL(IF($A$1:$A$79=$I$1,ROW($A$1:$A$79)),ROW(53:53)),5))","v":""},{"$f":"IF(ISERROR(INDEX($A$1:$G$79,SMALL(IF($A$1:$A$79=$I$1,ROW($A$1:$A$79)),ROW(53:53)),6)),\"\",INDEX($A$1:$G$79,SMALL(IF($A$1:$A$79=$I$1,ROW($A$1:$A$79)),ROW(53:53)),6))","v":""},{"$f":"IF(ISERROR(INDEX($A$1:$H$79,SMALL(IF($A$1:$A$79=$I$1,ROW($A$1:$A$79)),ROW(53:53)),8)),\"\",INDEX($A$1:$H$79,SMALL(IF($A$1:$A$79=$I$1,ROW($A$1:$A$79)),ROW(53:53)),8))","v":""},{"$f":"IF(ISERROR(INDEX($A$1:$G$79,SMALL(IF($B$1:$B$79=$N$1,ROW($B$1:$B$79)),ROW(53:53)),6)),\"\",INDEX($A$1:$G$79,SMALL(IF($B$1:$B$79=$N$1,ROW($B$1:$B$79)),ROW(53:53)),6))","v":""},{"$f":"IF(ISERROR(INDEX($A$1:$G$79,SMALL(IF($B$1:$B$79=$N$1,ROW($B$1:$B$79)),ROW(53:53)),4)),\"\",INDEX($A$1:$G$79,SMALL(IF($B$1:$B$79=$N$1,ROW($B$1:$B$79)),ROW(53:53)),4))","v":""},{"$f":"IF(ISERROR(INDEX($A$1:$G$79,SMALL(IF($B$1:$B$79=$N$1,ROW($B$1:$B$79)),ROW(53:53)),5)),\"\",INDEX($A$1:$G$79,SMALL(IF($B$1:$B$79=$N$1,ROW($B$1:$B$79)),ROW(53:53)),5))","v":""},{"$f":"IF(ISERROR(INDEX($A$1:$G$79,SMALL(IF($B$1:$B$79=$N$1,ROW($B$1:$B$79)),ROW(53:53)),7)),\"\",INDEX($A$1:$G$79,SMALL(IF($B$1:$B$79=$N$1,ROW($B$1:$B$79)),ROW(53:53)),7))","v":""},{"$f":"IF(ISERROR(INDEX($A$1:$H$79,SMALL(IF($B$1:$B$79=$N$1,ROW($B$1:$B$79)),ROW(53:53)),8)),\"\",INDEX($A$1:$H$79,SMALL(IF($B$1:$B$79=$N$1,ROW($B$1:$B$79)),ROW(53:53)),8))","v":""},{"$f":"IF(ISERROR(INDEX($A$1:$G$79,SMALL(IF($C$1:$C$79=$S$1,ROW($C$1:$C$79)),ROW(53:53)),6)),\"\",INDEX($A$1:$G$79,SMALL(IF($C$1:$C$79=$S$1,ROW($C$1:$C$79)),ROW(53:53)),6))","v":""},{"$f":"IF(ISERROR(INDEX($A$1:$G$79,SMALL(IF($C$1:$C$79=$S$1,ROW($C$1:$C$79)),ROW(53:53)),4)),\"\",INDEX($A$1:$G$79,SMALL(IF($C$1:$C$79=$S$1,ROW($C$1:$C$79)),ROW(53:53)),4))","v":""},{"$f":"IF(ISERROR(INDEX($A$1:$G$79,SMALL(IF($C$1:$C$79=$S$1,ROW($C$1:$C$79)),ROW(53:53)),5)),\"\",INDEX($A$1:$G$79,SMALL(IF($C$1:$C$79=$S$1,ROW($C$1:$C$79)),ROW(53:53)),5))","v":""},{"$f":"IF(ISERROR(INDEX($A$1:$G$79,SMALL(IF($C$1:$C$79=$S$1,ROW($C$1:$C$79)),ROW(53:53)),7)),\"\",INDEX($A$1:$G$79,SMALL(IF($C$1:$C$79=$S$1,ROW($C$1:$C$79)),ROW(53:53)),7))","v":""},{"$f":"IF(ISERROR(INDEX($A$1:$H$79,SMALL(IF($C$1:$C$79=$S$1,ROW($C$1:$C$79)),ROW(53:53)),8)),\"\",INDEX($A$1:$H$79,SMALL(IF($C$1:$C$79=$S$1,ROW($C$1:$C$79)),ROW(53:53)),8))","v":""}," "]
[{"$f":"Leases!F20","v":0},{"$f":"Leases!G20","v":0},{"$f":"Leases!H20","v":0},{"$f":"Leases!B20","v":0},{"$f":"Leases!C20","v":0},{"$f":"Leases!D20","v":"Optional notes here"},"Leases",0,{"$f":"IF(ISERROR(INDEX($A$1:$G$79,SMALL(IF($A$1:$A$79=$I$1,ROW($A$1:$A$79)),ROW(54:54)),7)),\"\",INDEX($A$1:$G$79,SMALL(IF($A$1:$A$79=$I$1,ROW($A$1:$A$79)),ROW(54:54)),7))","v":""},{"$f":"IF(ISERROR(INDEX($A$1:$G$79,SMALL(IF($A$1:$A$79=$I$1,ROW($A$1:$A$79)),ROW(54:54)),4)),\"\",INDEX($A$1:$G$79,SMALL(IF($A$1:$A$79=$I$1,ROW($A$1:$A$79)),ROW(54:54)),4))","v":""},{"$f":"IF(ISERROR(INDEX($A$1:$G$79,SMALL(IF($A$1:$A$79=$I$1,ROW($A$1:$A$79)),ROW(54:54)),5)),\"\",INDEX($A$1:$G$79,SMALL(IF($A$1:$A$79=$I$1,ROW($A$1:$A$79)),ROW(54:54)),5))","v":""},{"$f":"IF(ISERROR(INDEX($A$1:$G$79,SMALL(IF($A$1:$A$79=$I$1,ROW($A$1:$A$79)),ROW(54:54)),6)),\"\",INDEX($A$1:$G$79,SMALL(IF($A$1:$A$79=$I$1,ROW($A$1:$A$79)),ROW(54:54)),6))","v":""},{"$f":"IF(ISERROR(INDEX($A$1:$H$79,SMALL(IF($A$1:$A$79=$I$1,ROW($A$1:$A$79)),ROW(54:54)),8)),\"\",INDEX($A$1:$H$79,SMALL(IF($A$1:$A$79=$I$1,ROW($A$1:$A$79)),ROW(54:54)),8))","v":""},{"$f":"IF(ISERROR(INDEX($A$1:$G$79,SMALL(IF($B$1:$B$79=$N$1,ROW($B$1:$B$79)),ROW(54:54)),6)),\"\",INDEX($A$1:$G$79,SMALL(IF($B$1:$B$79=$N$1,ROW($B$1:$B$79)),ROW(54:54)),6))","v":""},{"$f":"IF(ISERROR(INDEX($A$1:$G$79,SMALL(IF($B$1:$B$79=$N$1,ROW($B$1:$B$79)),ROW(54:54)),4)),\"\",INDEX($A$1:$G$79,SMALL(IF($B$1:$B$79=$N$1,ROW($B$1:$B$79)),ROW(54:54)),4))","v":""},{"$f":"IF(ISERROR(INDEX($A$1:$G$79,SMALL(IF($B$1:$B$79=$N$1,ROW($B$1:$B$79)),ROW(54:54)),5)),\"\",INDEX($A$1:$G$79,SMALL(IF($B$1:$B$79=$N$1,ROW($B$1:$B$79)),ROW(54:54)),5))","v":""},{"$f":"IF(ISERROR(INDEX($A$1:$G$79,SMALL(IF($B$1:$B$79=$N$1,ROW($B$1:$B$79)),ROW(54:54)),7)),\"\",INDEX($A$1:$G$79,SMALL(IF($B$1:$B$79=$N$1,ROW($B$1:$B$79)),ROW(54:54)),7))","v":""},{"$f":"IF(ISERROR(INDEX($A$1:$H$79,SMALL(IF($B$1:$B$79=$N$1,ROW($B$1:$B$79)),ROW(54:54)),8)),\"\",INDEX($A$1:$H$79,SMALL(IF($B$1:$B$79=$N$1,ROW($B$1:$B$79)),ROW(54:54)),8))","v":""},{"$f":"IF(ISERROR(INDEX($A$1:$G$79,SMALL(IF($C$1:$C$79=$S$1,ROW($C$1:$C$79)),ROW(54:54)),6)),\"\",INDEX($A$1:$G$79,SMALL(IF($C$1:$C$79=$S$1,ROW($C$1:$C$79)),ROW(54:54)),6))","v":""},{"$f":"IF(ISERROR(INDEX($A$1:$G$79,SMALL(IF($C$1:$C$79=$S$1,ROW($C$1:$C$79)),ROW(54:54)),4)),\"\",INDEX($A$1:$G$79,SMALL(IF($C$1:$C$79=$S$1,ROW($C$1:$C$79)),ROW(54:54)),4))","v":""},{"$f":"IF(ISERROR(INDEX($A$1:$G$79,SMALL(IF($C$1:$C$79=$S$1,ROW($C$1:$C$79)),ROW(54:54)),5)),\"\",INDEX($A$1:$G$79,SMALL(IF($C$1:$C$79=$S$1,ROW($C$1:$C$79)),ROW(54:54)),5))","v":""},{"$f":"IF(ISERROR(INDEX($A$1:$G$79,SMALL(IF($C$1:$C$79=$S$1,ROW($C$1:$C$79)),ROW(54:54)),7)),\"\",INDEX($A$1:$G$79,SMALL(IF($C$1:$C$79=$S$1,ROW($C$1:$C$79)),ROW(54:54)),7))","v":""},{"$f":"IF(ISERROR(INDEX($A$1:$H$79,SMALL(IF($C$1:$C$79=$S$1,ROW($C$1:$C$79)),ROW(54:54)),8)),\"\",INDEX($A$1:$H$79,SMALL(IF($C$1:$C$79=$S$1,ROW($C$1:$C$79)),ROW(54:54)),8))","v":""}," "]
[{"$f":"'Project Specific'!F7","v":"Please select answer"},{"$f":"'Project Specific'!G7","v":"Please select answer"},{"$f":"'Project Specific'!H7","v":"Please select answer"},{"$f":"'Project Specific'!B7","v":1},{"$f":"'Project Specific'!C7","v":"Quick access to RRH assistance"},{"$f":"'Project Specific'!D7","v":"A Rapid Re-housing project ensures quick linkage to rapid re-housing assistance, based on participant choice. "},"Project-specific",{"$f":"F57","v":"Optional notes here"},{"$f":"IF(ISERROR(INDEX($A$1:$G$79,SMALL(IF($A$1:$A$79=$I$1,ROW($A$1:$A$79)),ROW(55:55)),7)),\"\",INDEX($A$1:$G$79,SMALL(IF($A$1:$A$79=$I$1,ROW($A$1:$A$79)),ROW(55:55)),7))","v":""},{"$f":"IF(ISERROR(INDEX($A$1:$G$79,SMALL(IF($A$1:$A$79=$I$1,ROW($A$1:$A$79)),ROW(55:55)),4)),\"\",INDEX($A$1:$G$79,SMALL(IF($A$1:$A$79=$I$1,ROW($A$1:$A$79)),ROW(55:55)),4))","v":""},{"$f":"IF(ISERROR(INDEX($A$1:$G$79,SMALL(IF($A$1:$A$79=$I$1,ROW($A$1:$A$79)),ROW(55:55)),5)),\"\",INDEX($A$1:$G$79,SMALL(IF($A$1:$A$79=$I$1,ROW($A$1:$A$79)),ROW(55:55)),5))","v":""},{"$f":"IF(ISERROR(INDEX($A$1:$G$79,SMALL(IF($A$1:$A$79=$I$1,ROW($A$1:$A$79)),ROW(55:55)),6)),\"\",INDEX($A$1:$G$79,SMALL(IF($A$1:$A$79=$I$1,ROW($A$1:$A$79)),ROW(55:55)),6))","v":""},{"$f":"IF(ISERROR(INDEX($A$1:$H$79,SMALL(IF($A$1:$A$79=$I$1,ROW($A$1:$A$79)),ROW(55:55)),8)),\"\",INDEX($A$1:$H$79,SMALL(IF($A$1:$A$79=$I$1,ROW($A$1:$A$79)),ROW(55:55)),8))","v":""},{"$f":"IF(ISERROR(INDEX($A$1:$G$79,SMALL(IF($B$1:$B$79=$N$1,ROW($B$1:$B$79)),ROW(55:55)),6)),\"\",INDEX($A$1:$G$79,SMALL(IF($B$1:$B$79=$N$1,ROW($B$1:$B$79)),ROW(55:55)),6))","v":""},{"$f":"IF(ISERROR(INDEX($A$1:$G$79,SMALL(IF($B$1:$B$79=$N$1,ROW($B$1:$B$79)),ROW(55:55)),4)),\"\",INDEX($A$1:$G$79,SMALL(IF($B$1:$B$79=$N$1,ROW($B$1:$B$79)),ROW(55:55)),4))","v":""},{"$f":"IF(ISERROR(INDEX($A$1:$G$79,SMALL(IF($B$1:$B$79=$N$1,ROW($B$1:$B$79)),ROW(55:55)),5)),\"\",INDEX($A$1:$G$79,SMALL(IF($B$1:$B$79=$N$1,ROW($B$1:$B$79)),ROW(55:55)),5))","v":""},{"$f":"IF(ISERROR(INDEX($A$1:$G$79,SMALL(IF($B$1:$B$79=$N$1,ROW($B$1:$B$79)),ROW(55:55)),7)),\"\",INDEX($A$1:$G$79,SMALL(IF($B$1:$B$79=$N$1,ROW($B$1:$B$79)),ROW(55:55)),7))","v":""},{"$f":"IF(ISERROR(INDEX($A$1:$H$79,SMALL(IF($B$1:$B$79=$N$1,ROW($B$1:$B$79)),ROW(55:55)),8)),\"\",INDEX($A$1:$H$79,SMALL(IF($B$1:$B$79=$N$1,ROW($B$1:$B$79)),ROW(55:55)),8))","v":""},{"$f":"IF(ISERROR(INDEX($A$1:$G$79,SMALL(IF($C$1:$C$79=$S$1,ROW($C$1:$C$79)),ROW(55:55)),6)),\"\",INDEX($A$1:$G$79,SMALL(IF($C$1:$C$79=$S$1,ROW($C$1:$C$79)),ROW(55:55)),6))","v":""},{"$f":"IF(ISERROR(INDEX($A$1:$G$79,SMALL(IF($C$1:$C$79=$S$1,ROW($C$1:$C$79)),ROW(55:55)),4)),\"\",INDEX($A$1:$G$79,SMALL(IF($C$1:$C$79=$S$1,ROW($C$1:$C$79)),ROW(55:55)),4))","v":""},{"$f":"IF(ISERROR(INDEX($A$1:$G$79,SMALL(IF($C$1:$C$79=$S$1,ROW($C$1:$C$79)),ROW(55:55)),5)),\"\",INDEX($A$1:$G$79,SMALL(IF($C$1:$C$79=$S$1,ROW($C$1:$C$79)),ROW(55:55)),5))","v":""},{"$f":"IF(ISERROR(INDEX($A$1:$G$79,SMALL(IF($C$1:$C$79=$S$1,ROW($C$1:$C$79)),ROW(55:55)),7)),\"\",INDEX($A$1:$G$79,SMALL(IF($C$1:$C$79=$S$1,ROW($C$1:$C$79)),ROW(55:55)),7))","v":""},{"$f":"IF(ISERROR(INDEX($A$1:$H$79,SMALL(IF($C$1:$C$79=$S$1,ROW($C$1:$C$79)),ROW(55:55)),8)),\"\",INDEX($A$1:$H$79,SMALL(IF($C$1:$C$79=$S$1,ROW($C$1:$C$79)),ROW(55:55)),8))","v":""}," "]
[{"$f":"'Project Specific'!F8","v":0},{"$f":"'Project Specific'!G8","v":0},{"$f":"'Project Specific'!H8","v":0},{"$f":"'Project Specific'!B8","v":0},{"$f":"'Project Specific'!C8","v":0},{"$f":"'Project Specific'!D8","v":"Optional notes here"},"Project-specific",0,{"$f":"IF(ISERROR(INDEX($A$1:$G$79,SMALL(IF($A$1:$A$79=$I$1,ROW($A$1:$A$79)),ROW(56:56)),7)),\"\",INDEX($A$1:$G$79,SMALL(IF($A$1:$A$79=$I$1,ROW($A$1:$A$79)),ROW(56:56)),7))","v":""},{"$f":"IF(ISERROR(INDEX($A$1:$G$79,SMALL(IF($A$1:$A$79=$I$1,ROW($A$1:$A$79)),ROW(56:56)),4)),\"\",INDEX($A$1:$G$79,SMALL(IF($A$1:$A$79=$I$1,ROW($A$1:$A$79)),ROW(56:56)),4))","v":""},{"$f":"IF(ISERROR(INDEX($A$1:$G$79,SMALL(IF($A$1:$A$79=$I$1,ROW($A$1:$A$79)),ROW(56:56)),5)),\"\",INDEX($A$1:$G$79,SMALL(IF($A$1:$A$79=$I$1,ROW($A$1:$A$79)),ROW(56:56)),5))","v":""},{"$f":"IF(ISERROR(INDEX($A$1:$G$79,SMALL(IF($A$1:$A$79=$I$1,ROW($A$1:$A$79)),ROW(56:56)),6)),\"\",INDEX($A$1:$G$79,SMALL(IF($A$1:$A$79=$I$1,ROW($A$1:$A$79)),ROW(56:56)),6))","v":""},{"$f":"IF(ISERROR(INDEX($A$1:$H$79,SMALL(IF($A$1:$A$79=$I$1,ROW($A$1:$A$79)),ROW(56:56)),8)),\"\",INDEX($A$1:$H$79,SMALL(IF($A$1:$A$79=$I$1,ROW($A$1:$A$79)),ROW(56:56)),8))","v":""},{"$f":"IF(ISERROR(INDEX($A$1:$G$79,SMALL(IF($B$1:$B$79=$N$1,ROW($B$1:$B$79)),ROW(56:56)),6)),\"\",INDEX($A$1:$G$79,SMALL(IF($B$1:$B$79=$N$1,ROW($B$1:$B$79)),ROW(56:56)),6))","v":""},{"$f":"IF(ISERROR(INDEX($A$1:$G$79,SMALL(IF($B$1:$B$79=$N$1,ROW($B$1:$B$79)),ROW(56:56)),4)),\"\",INDEX($A$1:$G$79,SMALL(IF($B$1:$B$79=$N$1,ROW($B$1:$B$79)),ROW(56:56)),4))","v":""},{"$f":"IF(ISERROR(INDEX($A$1:$G$79,SMALL(IF($B$1:$B$79=$N$1,ROW($B$1:$B$79)),ROW(56:56)),5)),\"\",INDEX($A$1:$G$79,SMALL(IF($B$1:$B$79=$N$1,ROW($B$1:$B$79)),ROW(56:56)),5))","v":""},{"$f":"IF(ISERROR(INDEX($A$1:$G$79,SMALL(IF($B$1:$B$79=$N$1,ROW($B$1:$B$79)),ROW(56:56)),7)),\"\",INDEX($A$1:$G$79,SMALL(IF($B$1:$B$79=$N$1,ROW($B$1:$B$79)),ROW(56:56)),7))","v":""},{"$f":"IF(ISERROR(INDEX($A$1:$H$79,SMALL(IF($B$1:$B$79=$N$1,ROW($B$1:$B$79)),ROW(56:56)),8)),\"\",INDEX($A$1:$H$79,SMALL(IF($B$1:$B$79=$N$1,ROW($B$1:$B$79)),ROW(56:56)),8))","v":""},{"$f":"IF(ISERROR(INDEX($A$1:$G$79,SMALL(IF($C$1:$C$79=$S$1,ROW($C$1:$C$79)),ROW(56:56)),6)),\"\",INDEX($A$1:$G$79,SMALL(IF($C$1:$C$79=$S$1,ROW($C$1:$C$79)),ROW(56:56)),6))","v":""},{"$f":"IF(ISERROR(INDEX($A$1:$G$79,SMALL(IF($C$1:$C$79=$S$1,ROW($C$1:$C$79)),ROW(56:56)),4)),\"\",INDEX($A$1:$G$79,SMALL(IF($C$1:$C$79=$S$1,ROW($C$1:$C$79)),ROW(56:56)),4))","v":""},{"$f":"IF(ISERROR(INDEX($A$1:$G$79,SMALL(IF($C$1:$C$79=$S$1,ROW($C$1:$C$79)),ROW(56:56)),5)),\"\",INDEX($A$1:$G$79,SMALL(IF($C$1:$C$79=$S$1,ROW($C$1:$C$79)),ROW(56:56)),5))","v":""},{"$f":"IF(ISERROR(INDEX($A$1:$G$79,SMALL(IF($C$1:$C$79=$S$1,ROW($C$1:$C$79)),ROW(56:56)),7)),\"\",INDEX($A$1:$G$79,SMALL(IF($C$1:$C$79=$S$1,ROW($C$1:$C$79)),ROW(56:56)),7))","v":""},{"$f":"IF(ISERROR(INDEX($A$1:$H$79,SMALL(IF($C$1:$C$79=$S$1,ROW($C$1:$C$79)),ROW(56:56)),8)),\"\",INDEX($A$1:$H$79,SMALL(IF($C$1:$C$79=$S$1,ROW($C$1:$C$79)),ROW(56:56)),8))","v":""}," "]
[{"$f":"'Project Specific'!F9","v":"Please select answer"},{"$f":"'Project Specific'!G9","v":"Please select answer"},{"$f":"'Project Specific'!H9","v":"Please select answer"},{"$f":"'Project Specific'!B9","v":2},{"$f":"'Project Specific'!C9","v":"RRH services support people in maintaining their housing"},{"$f":"'Project Specific'!D9","v":"Participants and staff understand that a primary goal of rapid re-housing is to end homelessness and move participants to permanent housing as quickly as possible, regardless of perceived barriers."},"Project-specific",{"$f":"F59","v":"Optional notes here"},{"$f":"IF(ISERROR(INDEX($A$1:$G$79,SMALL(IF($A$1:$A$79=$I$1,ROW($A$1:$A$79)),ROW(57:57)),7)),\"\",INDEX($A$1:$G$79,SMALL(IF($A$1:$A$79=$I$1,ROW($A$1:$A$79)),ROW(57:57)),7))","v":""},{"$f":"IF(ISERROR(INDEX($A$1:$G$79,SMALL(IF($A$1:$A$79=$I$1,ROW($A$1:$A$79)),ROW(57:57)),4)),\"\",INDEX($A$1:$G$79,SMALL(IF($A$1:$A$79=$I$1,ROW($A$1:$A$79)),ROW(57:57)),4))","v":""},{"$f":"IF(ISERROR(INDEX($A$1:$G$79,SMALL(IF($A$1:$A$79=$I$1,ROW($A$1:$A$79)),ROW(57:57)),5)),\"\",INDEX($A$1:$G$79,SMALL(IF($A$1:$A$79=$I$1,ROW($A$1:$A$79)),ROW(57:57)),5))","v":""},{"$f":"IF(ISERROR(INDEX($A$1:$G$79,SMALL(IF($A$1:$A$79=$I$1,ROW($A$1:$A$79)),ROW(57:57)),6)),\"\",INDEX($A$1:$G$79,SMALL(IF($A$1:$A$79=$I$1,ROW($A$1:$A$79)),ROW(57:57)),6))","v":""},{"$f":"IF(ISERROR(INDEX($A$1:$H$79,SMALL(IF($A$1:$A$79=$I$1,ROW($A$1:$A$79)),ROW(57:57)),8)),\"\",INDEX($A$1:$H$79,SMALL(IF($A$1:$A$79=$I$1,ROW($A$1:$A$79)),ROW(57:57)),8))","v":""},{"$f":"IF(ISERROR(INDEX($A$1:$G$79,SMALL(IF($B$1:$B$79=$N$1,ROW($B$1:$B$79)),ROW(57:57)),6)),\"\",INDEX($A$1:$G$79,SMALL(IF($B$1:$B$79=$N$1,ROW($B$1:$B$79)),ROW(57:57)),6))","v":""},{"$f":"IF(ISERROR(INDEX($A$1:$G$79,SMALL(IF($B$1:$B$79=$N$1,ROW($B$1:$B$79)),ROW(57:57)),4)),\"\",INDEX($A$1:$G$79,SMALL(IF($B$1:$B$79=$N$1,ROW($B$1:$B$79)),ROW(57:57)),4))","v":""},{"$f":"IF(ISERROR(INDEX($A$1:$G$79,SMALL(IF($B$1:$B$79=$N$1,ROW($B$1:$B$79)),ROW(57:57)),5)),\"\",INDEX($A$1:$G$79,SMALL(IF($B$1:$B$79=$N$1,ROW($B$1:$B$79)),ROW(57:57)),5))","v":""},{"$f":"IF(ISERROR(INDEX($A$1:$G$79,SMALL(IF($B$1:$B$79=$N$1,ROW($B$1:$B$79)),ROW(57:57)),7)),\"\",INDEX($A$1:$G$79,SMALL(IF($B$1:$B$79=$N$1,ROW($B$1:$B$79)),ROW(57:57)),7))","v":""},{"$f":"IF(ISERROR(INDEX($A$1:$H$79,SMALL(IF($B$1:$B$79=$N$1,ROW($B$1:$B$79)),ROW(57:57)),8)),\"\",INDEX($A$1:$H$79,SMALL(IF($B$1:$B$79=$N$1,ROW($B$1:$B$79)),ROW(57:57)),8))","v":""},{"$f":"IF(ISERROR(INDEX($A$1:$G$79,SMALL(IF($C$1:$C$79=$S$1,ROW($C$1:$C$79)),ROW(57:57)),6)),\"\",INDEX($A$1:$G$79,SMALL(IF($C$1:$C$79=$S$1,ROW($C$1:$C$79)),ROW(57:57)),6))","v":""},{"$f":"IF(ISERROR(INDEX($A$1:$G$79,SMALL(IF($C$1:$C$79=$S$1,ROW($C$1:$C$79)),ROW(57:57)),4)),\"\",INDEX($A$1:$G$79,SMALL(IF($C$1:$C$79=$S$1,ROW($C$1:$C$79)),ROW(57:57)),4))","v":""},{"$f":"IF(ISERROR(INDEX($A$1:$G$79,SMALL(IF($C$1:$C$79=$S$1,ROW($C$1:$C$79)),ROW(57:57)),5)),\"\",INDEX($A$1:$G$79,SMALL(IF($C$1:$C$79=$S$1,ROW($C$1:$C$79)),ROW(57:57)),5))","v":""},{"$f":"IF(ISERROR(INDEX($A$1:$G$79,SMALL(IF($C$1:$C$79=$S$1,ROW($C$1:$C$79)),ROW(57:57)),7)),\"\",INDEX($A$1:$G$79,SMALL(IF($C$1:$C$79=$S$1,ROW($C$1:$C$79)),ROW(57:57)),7))","v":""},{"$f":"IF(ISERROR(INDEX($A$1:$H$79,SMALL(IF($C$1:$C$79=$S$1,ROW($C$1:$C$79)),ROW(57:57)),8)),\"\",INDEX($A$1:$H$79,SMALL(IF($C$1:$C$79=$S$1,ROW($C$1:$C$79)),ROW(57:57)),8))","v":""}," "]
[{"$f":"'Project Specific'!F10","v":0},{"$f":"'Project Specific'!G10","v":0},{"$f":"'Project Specific'!H10","v":0},{"$f":"'Project Specific'!B10","v":0},{"$f":"'Project Specific'!C10","v":0},{"$f":"'Project Specific'!D10","v":"Optional notes here"},"Project-specific",0,{"$f":"IF(ISERROR(INDEX($A$1:$G$79,SMALL(IF($A$1:$A$79=$I$1,ROW($A$1:$A$79)),ROW(58:58)),7)),\"\",INDEX($A$1:$G$79,SMALL(IF($A$1:$A$79=$I$1,ROW($A$1:$A$79)),ROW(58:58)),7))","v":""},{"$f":"IF(ISERROR(INDEX($A$1:$G$79,SMALL(IF($A$1:$A$79=$I$1,ROW($A$1:$A$79)),ROW(58:58)),4)),\"\",INDEX($A$1:$G$79,SMALL(IF($A$1:$A$79=$I$1,ROW($A$1:$A$79)),ROW(58:58)),4))","v":""},{"$f":"IF(ISERROR(INDEX($A$1:$G$79,SMALL(IF($A$1:$A$79=$I$1,ROW($A$1:$A$79)),ROW(58:58)),5)),\"\",INDEX($A$1:$G$79,SMALL(IF($A$1:$A$79=$I$1,ROW($A$1:$A$79)),ROW(58:58)),5))","v":""},{"$f":"IF(ISERROR(INDEX($A$1:$G$79,SMALL(IF($A$1:$A$79=$I$1,ROW($A$1:$A$79)),ROW(58:58)),6)),\"\",INDEX($A$1:$G$79,SMALL(IF($A$1:$A$79=$I$1,ROW($A$1:$A$79)),ROW(58:58)),6))","v":""},{"$f":"IF(ISERROR(INDEX($A$1:$H$79,SMALL(IF($A$1:$A$79=$I$1,ROW($A$1:$A$79)),ROW(58:58)),8)),\"\",INDEX($A$1:$H$79,SMALL(IF($A$1:$A$79=$I$1,ROW($A$1:$A$79)),ROW(58:58)),8))","v":""},{"$f":"IF(ISERROR(INDEX($A$1:$G$79,SMALL(IF($B$1:$B$79=$N$1,ROW($B$1:$B$79)),ROW(58:58)),6)),\"\",INDEX($A$1:$G$79,SMALL(IF($B$1:$B$79=$N$1,ROW($B$1:$B$79)),ROW(58:58)),6))","v":""},{"$f":"IF(ISERROR(INDEX($A$1:$G$79,SMALL(IF($B$1:$B$79=$N$1,ROW($B$1:$B$79)),ROW(58:58)),4)),\"\",INDEX($A$1:$G$79,SMALL(IF($B$1:$B$79=$N$1,ROW($B$1:$B$79)),ROW(58:58)),4))","v":""},{"$f":"IF(ISERROR(INDEX($A$1:$G$79,SMALL(IF($B$1:$B$79=$N$1,ROW($B$1:$B$79)),ROW(58:58)),5)),\"\",INDEX($A$1:$G$79,SMALL(IF($B$1:$B$79=$N$1,ROW($B$1:$B$79)),ROW(58:58)),5))","v":""},{"$f":"IF(ISERROR(INDEX($A$1:$G$79,SMALL(IF($B$1:$B$79=$N$1,ROW($B$1:$B$79)),ROW(58:58)),7)),\"\",INDEX($A$1:$G$79,SMALL(IF($B$1:$B$79=$N$1,ROW($B$1:$B$79)),ROW(58:58)),7))","v":""},{"$f":"IF(ISERROR(INDEX($A$1:$H$79,SMALL(IF($B$1:$B$79=$N$1,ROW($B$1:$B$79)),ROW(58:58)),8)),\"\",INDEX($A$1:$H$79,SMALL(IF($B$1:$B$79=$N$1,ROW($B$1:$B$79)),ROW(58:58)),8))","v":""},{"$f":"IF(ISERROR(INDEX($A$1:$G$79,SMALL(IF($C$1:$C$79=$S$1,ROW($C$1:$C$79)),ROW(58:58)),6)),\"\",INDEX($A$1:$G$79,SMALL(IF($C$1:$C$79=$S$1,ROW($C$1:$C$79)),ROW(58:58)),6))","v":""},{"$f":"IF(ISERROR(INDEX($A$1:$G$79,SMALL(IF($C$1:$C$79=$S$1,ROW($C$1:$C$79)),ROW(58:58)),4)),\"\",INDEX($A$1:$G$79,SMALL(IF($C$1:$C$79=$S$1,ROW($C$1:$C$79)),ROW(58:58)),4))","v":""},{"$f":"IF(ISERROR(INDEX($A$1:$G$79,SMALL(IF($C$1:$C$79=$S$1,ROW($C$1:$C$79)),ROW(58:58)),5)),\"\",INDEX($A$1:$G$79,SMALL(IF($C$1:$C$79=$S$1,ROW($C$1:$C$79)),ROW(58:58)),5))","v":""},{"$f":"IF(ISERROR(INDEX($A$1:$G$79,SMALL(IF($C$1:$C$79=$S$1,ROW($C$1:$C$79)),ROW(58:58)),7)),\"\",INDEX($A$1:$G$79,SMALL(IF($C$1:$C$79=$S$1,ROW($C$1:$C$79)),ROW(58:58)),7))","v":""},{"$f":"IF(ISERROR(INDEX($A$1:$H$79,SMALL(IF($C$1:$C$79=$S$1,ROW($C$1:$C$79)),ROW(58:58)),8)),\"\",INDEX($A$1:$H$79,SMALL(IF($C$1:$C$79=$S$1,ROW($C$1:$C$79)),ROW(58:58)),8))","v":""}," "]
[{"$f":"'Project Specific'!F11","v":"Please select answer"},{"$f":"'Project Specific'!G11","v":"Please select answer"},{"$f":"'Project Specific'!H11","v":"Please select answer"},{"$f":"'Project Specific'!B11","v":3},{"$f":"'Project Specific'!C11","v":"Providers continuously assess a participant’s need for assistance"},{"$f":"'Project Specific'!D11","v":"On an ongoing basis, providers assess a participant’s needs for continued assistance and provide tailored assistance based on those assessments."},"Project-specific",{"$f":"F61","v":"Optional notes here"},{"$f":"IF(ISERROR(INDEX($A$1:$G$79,SMALL(IF($A$1:$A$79=$I$1,ROW($A$1:$A$79)),ROW(59:59)),7)),\"\",INDEX($A$1:$G$79,SMALL(IF($A$1:$A$79=$I$1,ROW($A$1:$A$79)),ROW(59:59)),7))","v":""},{"$f":"IF(ISERROR(INDEX($A$1:$G$79,SMALL(IF($A$1:$A$79=$I$1,ROW($A$1:$A$79)),ROW(59:59)),4)),\"\",INDEX($A$1:$G$79,SMALL(IF($A$1:$A$79=$I$1,ROW($A$1:$A$79)),ROW(59:59)),4))","v":""},{"$f":"IF(ISERROR(INDEX($A$1:$G$79,SMALL(IF($A$1:$A$79=$I$1,ROW($A$1:$A$79)),ROW(59:59)),5)),\"\",INDEX($A$1:$G$79,SMALL(IF($A$1:$A$79=$I$1,ROW($A$1:$A$79)),ROW(59:59)),5))","v":""},{"$f":"IF(ISERROR(INDEX($A$1:$G$79,SMALL(IF($A$1:$A$79=$I$1,ROW($A$1:$A$79)),ROW(59:59)),6)),\"\",INDEX($A$1:$G$79,SMALL(IF($A$1:$A$79=$I$1,ROW($A$1:$A$79)),ROW(59:59)),6))","v":""},{"$f":"IF(ISERROR(INDEX($A$1:$H$79,SMALL(IF($A$1:$A$79=$I$1,ROW($A$1:$A$79)),ROW(59:59)),8)),\"\",INDEX($A$1:$H$79,SMALL(IF($A$1:$A$79=$I$1,ROW($A$1:$A$79)),ROW(59:59)),8))","v":""},{"$f":"IF(ISERROR(INDEX($A$1:$G$79,SMALL(IF($B$1:$B$79=$N$1,ROW($B$1:$B$79)),ROW(59:59)),6)),\"\",INDEX($A$1:$G$79,SMALL(IF($B$1:$B$79=$N$1,ROW($B$1:$B$79)),ROW(59:59)),6))","v":""},{"$f":"IF(ISERROR(INDEX($A$1:$G$79,SMALL(IF($B$1:$B$79=$N$1,ROW($B$1:$B$79)),ROW(59:59)),4)),\"\",INDEX($A$1:$G$79,SMALL(IF($B$1:$B$79=$N$1,ROW($B$1:$B$79)),ROW(59:59)),4))","v":""},{"$f":"IF(ISERROR(INDEX($A$1:$G$79,SMALL(IF($B$1:$B$79=$N$1,ROW($B$1:$B$79)),ROW(59:59)),5)),\"\",INDEX($A$1:$G$79,SMALL(IF($B$1:$B$79=$N$1,ROW($B$1:$B$79)),ROW(59:59)),5))","v":""},{"$f":"IF(ISERROR(INDEX($A$1:$G$79,SMALL(IF($B$1:$B$79=$N$1,ROW($B$1:$B$79)),ROW(59:59)),7)),\"\",INDEX($A$1:$G$79,SMALL(IF($B$1:$B$79=$N$1,ROW($B$1:$B$79)),ROW(59:59)),7))","v":""},{"$f":"IF(ISERROR(INDEX($A$1:$H$79,SMALL(IF($B$1:$B$79=$N$1,ROW($B$1:$B$79)),ROW(59:59)),8)),\"\",INDEX($A$1:$H$79,SMALL(IF($B$1:$B$79=$N$1,ROW($B$1:$B$79)),ROW(59:59)),8))","v":""},{"$f":"IF(ISERROR(INDEX($A$1:$G$79,SMALL(IF($C$1:$C$79=$S$1,ROW($C$1:$C$79)),ROW(59:59)),6)),\"\",INDEX($A$1:$G$79,SMALL(IF($C$1:$C$79=$S$1,ROW($C$1:$C$79)),ROW(59:59)),6))","v":""},{"$f":"IF(ISERROR(INDEX($A$1:$G$79,SMALL(IF($C$1:$C$79=$S$1,ROW($C$1:$C$79)),ROW(59:59)),4)),\"\",INDEX($A$1:$G$79,SMALL(IF($C$1:$C$79=$S$1,ROW($C$1:$C$79)),ROW(59:59)),4))","v":""},{"$f":"IF(ISERROR(INDEX($A$1:$G$79,SMALL(IF($C$1:$C$79=$S$1,ROW($C$1:$C$79)),ROW(59:59)),5)),\"\",INDEX($A$1:$G$79,SMALL(IF($C$1:$C$79=$S$1,ROW($C$1:$C$79)),ROW(59:59)),5))","v":""},{"$f":"IF(ISERROR(INDEX($A$1:$G$79,SMALL(IF($C$1:$C$79=$S$1,ROW($C$1:$C$79)),ROW(59:59)),7)),\"\",INDEX($A$1:$G$79,SMALL(IF($C$1:$C$79=$S$1,ROW($C$1:$C$79)),ROW(59:59)),7))","v":""},{"$f":"IF(ISERROR(INDEX($A$1:$H$79,SMALL(IF($C$1:$C$79=$S$1,ROW($C$1:$C$79)),ROW(59:59)),8)),\"\",INDEX($A$1:$H$79,SMALL(IF($C$1:$C$79=$S$1,ROW($C$1:$C$79)),ROW(59:59)),8))","v":""}," "]
[{"$f":"'Project Specific'!F12","v":0},{"$f":"'Project Specific'!G12","v":0},{"$f":"'Project Specific'!H12","v":0},{"$f":"'Project Specific'!B12","v":0},{"$f":"'Project Specific'!C12","v":0},{"$f":"'Project Specific'!D12","v":"Optional notes here"},"Project-specific",0,{"$f":"IF(ISERROR(INDEX($A$1:$G$79,SMALL(IF($A$1:$A$79=$I$1,ROW($A$1:$A$79)),ROW(60:60)),7)),\"\",INDEX($A$1:$G$79,SMALL(IF($A$1:$A$79=$I$1,ROW($A$1:$A$79)),ROW(60:60)),7))","v":""},{"$f":"IF(ISERROR(INDEX($A$1:$G$79,SMALL(IF($A$1:$A$79=$I$1,ROW($A$1:$A$79)),ROW(60:60)),4)),\"\",INDEX($A$1:$G$79,SMALL(IF($A$1:$A$79=$I$1,ROW($A$1:$A$79)),ROW(60:60)),4))","v":""},{"$f":"IF(ISERROR(INDEX($A$1:$G$79,SMALL(IF($A$1:$A$79=$I$1,ROW($A$1:$A$79)),ROW(60:60)),5)),\"\",INDEX($A$1:$G$79,SMALL(IF($A$1:$A$79=$I$1,ROW($A$1:$A$79)),ROW(60:60)),5))","v":""},{"$f":"IF(ISERROR(INDEX($A$1:$G$79,SMALL(IF($A$1:$A$79=$I$1,ROW($A$1:$A$79)),ROW(60:60)),6)),\"\",INDEX($A$1:$G$79,SMALL(IF($A$1:$A$79=$I$1,ROW($A$1:$A$79)),ROW(60:60)),6))","v":""},{"$f":"IF(ISERROR(INDEX($A$1:$H$79,SMALL(IF($A$1:$A$79=$I$1,ROW($A$1:$A$79)),ROW(60:60)),8)),\"\",INDEX($A$1:$H$79,SMALL(IF($A$1:$A$79=$I$1,ROW($A$1:$A$79)),ROW(60:60)),8))","v":""},{"$f":"IF(ISERROR(INDEX($A$1:$G$79,SMALL(IF($B$1:$B$79=$N$1,ROW($B$1:$B$79)),ROW(60:60)),6)),\"\",INDEX($A$1:$G$79,SMALL(IF($B$1:$B$79=$N$1,ROW($B$1:$B$79)),ROW(60:60)),6))","v":""},{"$f":"IF(ISERROR(INDEX($A$1:$G$79,SMALL(IF($B$1:$B$79=$N$1,ROW($B$1:$B$79)),ROW(60:60)),4)),\"\",INDEX($A$1:$G$79,SMALL(IF($B$1:$B$79=$N$1,ROW($B$1:$B$79)),ROW(60:60)),4))","v":""},{"$f":"IF(ISERROR(INDEX($A$1:$G$79,SMALL(IF($B$1:$B$79=$N$1,ROW($B$1:$B$79)),ROW(60:60)),5)),\"\",INDEX($A$1:$G$79,SMALL(IF($B$1:$B$79=$N$1,ROW($B$1:$B$79)),ROW(60:60)),5))","v":""},{"$f":"IF(ISERROR(INDEX($A$1:$G$79,SMALL(IF($B$1:$B$79=$N$1,ROW($B$1:$B$79)),ROW(60:60)),7)),\"\",INDEX($A$1:$G$79,SMALL(IF($B$1:$B$79=$N$1,ROW($B$1:$B$79)),ROW(60:60)),7))","v":""},{"$f":"IF(ISERROR(INDEX($A$1:$H$79,SMALL(IF($B$1:$B$79=$N$1,ROW($B$1:$B$79)),ROW(60:60)),8)),\"\",INDEX($A$1:$H$79,SMALL(IF($B$1:$B$79=$N$1,ROW($B$1:$B$79)),ROW(60:60)),8))","v":""},{"$f":"IF(ISERROR(INDEX($A$1:$G$79,SMALL(IF($C$1:$C$79=$S$1,ROW($C$1:$C$79)),ROW(60:60)),6)),\"\",INDEX($A$1:$G$79,SMALL(IF($C$1:$C$79=$S$1,ROW($C$1:$C$79)),ROW(60:60)),6))","v":""},{"$f":"IF(ISERROR(INDEX($A$1:$G$79,SMALL(IF($C$1:$C$79=$S$1,ROW($C$1:$C$79)),ROW(60:60)),4)),\"\",INDEX($A$1:$G$79,SMALL(IF($C$1:$C$79=$S$1,ROW($C$1:$C$79)),ROW(60:60)),4))","v":""},{"$f":"IF(ISERROR(INDEX($A$1:$G$79,SMALL(IF($C$1:$C$79=$S$1,ROW($C$1:$C$79)),ROW(60:60)),5)),\"\",INDEX($A$1:$G$79,SMALL(IF($C$1:$C$79=$S$1,ROW($C$1:$C$79)),ROW(60:60)),5))","v":""},{"$f":"IF(ISERROR(INDEX($A$1:$G$79,SMALL(IF($C$1:$C$79=$S$1,ROW($C$1:$C$79)),ROW(60:60)),7)),\"\",INDEX($A$1:$G$79,SMALL(IF($C$1:$C$79=$S$1,ROW($C$1:$C$79)),ROW(60:60)),7))","v":""},{"$f":"IF(ISERROR(INDEX($A$1:$H$79,SMALL(IF($C$1:$C$79=$S$1,ROW($C$1:$C$79)),ROW(60:60)),8)),\"\",INDEX($A$1:$H$79,SMALL(IF($C$1:$C$79=$S$1,ROW($C$1:$C$79)),ROW(60:60)),8))","v":""}," "]
[{"$f":"'Project Specific'!F13","v":"Please select answer"},{"$f":"'Project Specific'!G13","v":"Please select answer"},{"$f":"'Project Specific'!H13","v":"Please select answer"},{"$f":"'Project Specific'!B13","v":4},{"$f":"'Project Specific'!C13","v":"Transitional housing is focused on safe and quick transitions to permanent housing"},{"$f":"'Project Specific'!D13","v":"Participants and staff understand that the primary goals of transitional housing are to provide temporary accommodations that are safe, respectful, and responsive to individual needs, address the services needs of participants, and re-house participants in permanent housing as quickly as possible, regardless of other personal issues or concerns, and as desired by the participant. Participation in transitional housing services does not inhibit participants from moving to permanent housing when they choose to. Assessment and planning for permanent housing placement begins as soon as the individual or family expresses a desire to transition to permanent housing."},"Project-specific",{"$f":"F63","v":"Optional notes here"},{"$f":"IF(ISERROR(INDEX($A$1:$G$79,SMALL(IF($A$1:$A$79=$I$1,ROW($A$1:$A$79)),ROW(61:61)),7)),\"\",INDEX($A$1:$G$79,SMALL(IF($A$1:$A$79=$I$1,ROW($A$1:$A$79)),ROW(61:61)),7))","v":""},{"$f":"IF(ISERROR(INDEX($A$1:$G$79,SMALL(IF($A$1:$A$79=$I$1,ROW($A$1:$A$79)),ROW(61:61)),4)),\"\",INDEX($A$1:$G$79,SMALL(IF($A$1:$A$79=$I$1,ROW($A$1:$A$79)),ROW(61:61)),4))","v":""},{"$f":"IF(ISERROR(INDEX($A$1:$G$79,SMALL(IF($A$1:$A$79=$I$1,ROW($A$1:$A$79)),ROW(61:61)),5)),\"\",INDEX($A$1:$G$79,SMALL(IF($A$1:$A$79=$I$1,ROW($A$1:$A$79)),ROW(61:61)),5))","v":""},{"$f":"IF(ISERROR(INDEX($A$1:$G$79,SMALL(IF($A$1:$A$79=$I$1,ROW($A$1:$A$79)),ROW(61:61)),6)),\"\",INDEX($A$1:$G$79,SMALL(IF($A$1:$A$79=$I$1,ROW($A$1:$A$79)),ROW(61:61)),6))","v":""},{"$f":"IF(ISERROR(INDEX($A$1:$H$79,SMALL(IF($A$1:$A$79=$I$1,ROW($A$1:$A$79)),ROW(61:61)),8)),\"\",INDEX($A$1:$H$79,SMALL(IF($A$1:$A$79=$I$1,ROW($A$1:$A$79)),ROW(61:61)),8))","v":""},{"$f":"IF(ISERROR(INDEX($A$1:$G$79,SMALL(IF($B$1:$B$79=$N$1,ROW($B$1:$B$79)),ROW(61:61)),6)),\"\",INDEX($A$1:$G$79,SMALL(IF($B$1:$B$79=$N$1,ROW($B$1:$B$79)),ROW(61:61)),6))","v":""},{"$f":"IF(ISERROR(INDEX($A$1:$G$79,SMALL(IF($B$1:$B$79=$N$1,ROW($B$1:$B$79)),ROW(61:61)),4)),\"\",INDEX($A$1:$G$79,SMALL(IF($B$1:$B$79=$N$1,ROW($B$1:$B$79)),ROW(61:61)),4))","v":""},{"$f":"IF(ISERROR(INDEX($A$1:$G$79,SMALL(IF($B$1:$B$79=$N$1,ROW($B$1:$B$79)),ROW(61:61)),5)),\"\",INDEX($A$1:$G$79,SMALL(IF($B$1:$B$79=$N$1,ROW($B$1:$B$79)),ROW(61:61)),5))","v":""},{"$f":"IF(ISERROR(INDEX($A$1:$G$79,SMALL(IF($B$1:$B$79=$N$1,ROW($B$1:$B$79)),ROW(61:61)),7)),\"\",INDEX($A$1:$G$79,SMALL(IF($B$1:$B$79=$N$1,ROW($B$1:$B$79)),ROW(61:61)),7))","v":""},{"$f":"IF(ISERROR(INDEX($A$1:$H$79,SMALL(IF($B$1:$B$79=$N$1,ROW($B$1:$B$79)),ROW(61:61)),8)),\"\",INDEX($A$1:$H$79,SMALL(IF($B$1:$B$79=$N$1,ROW($B$1:$B$79)),ROW(61:61)),8))","v":""},{"$f":"IF(ISERROR(INDEX($A$1:$G$79,SMALL(IF($C$1:$C$79=$S$1,ROW($C$1:$C$79)),ROW(61:61)),6)),\"\",INDEX($A$1:$G$79,SMALL(IF($C$1:$C$79=$S$1,ROW($C$1:$C$79)),ROW(61:61)),6))","v":""},{"$f":"IF(ISERROR(INDEX($A$1:$G$79,SMALL(IF($C$1:$C$79=$S$1,ROW($C$1:$C$79)),ROW(61:61)),4)),\"\",INDEX($A$1:$G$79,SMALL(IF($C$1:$C$79=$S$1,ROW($C$1:$C$79)),ROW(61:61)),4))","v":""},{"$f":"IF(ISERROR(INDEX($A$1:$G$79,SMALL(IF($C$1:$C$79=$S$1,ROW($C$1:$C$79)),ROW(61:61)),5)),\"\",INDEX($A$1:$G$79,SMALL(IF($C$1:$C$79=$S$1,ROW($C$1:$C$79)),ROW(61:61)),5))","v":""},{"$f":"IF(ISERROR(INDEX($A$1:$G$79,SMALL(IF($C$1:$C$79=$S$1,ROW($C$1:$C$79)),ROW(61:61)),7)),\"\",INDEX($A$1:$G$79,SMALL(IF($C$1:$C$79=$S$1,ROW($C$1:$C$79)),ROW(61:61)),7))","v":""},{"$f":"IF(ISERROR(INDEX($A$1:$H$79,SMALL(IF($C$1:$C$79=$S$1,ROW($C$1:$C$79)),ROW(61:61)),8)),\"\",INDEX($A$1:$H$79,SMALL(IF($C$1:$C$79=$S$1,ROW($C$1:$C$79)),ROW(61:61)),8))","v":""}," "]
[{"$f":"'Project Specific'!F14","v":0},{"$f":"'Project Specific'!G14","v":0},{"$f":"'Project Specific'!H14","v":0},{"$f":"'Project Specific'!B14","v":0},{"$f":"'Project Specific'!C14","v":0},{"$f":"'Project Specific'!D14","v":"Optional notes here"},"Project-specific",0,{"$f":"IF(ISERROR(INDEX($A$1:$G$79,SMALL(IF($A$1:$A$79=$I$1,ROW($A$1:$A$79)),ROW(62:62)),7)),\"\",INDEX($A$1:$G$79,SMALL(IF($A$1:$A$79=$I$1,ROW($A$1:$A$79)),ROW(62:62)),7))","v":""},{"$f":"IF(ISERROR(INDEX($A$1:$G$79,SMALL(IF($A$1:$A$79=$I$1,ROW($A$1:$A$79)),ROW(62:62)),4)),\"\",INDEX($A$1:$G$79,SMALL(IF($A$1:$A$79=$I$1,ROW($A$1:$A$79)),ROW(62:62)),4))","v":""},{"$f":"IF(ISERROR(INDEX($A$1:$G$79,SMALL(IF($A$1:$A$79=$I$1,ROW($A$1:$A$79)),ROW(62:62)),5)),\"\",INDEX($A$1:$G$79,SMALL(IF($A$1:$A$79=$I$1,ROW($A$1:$A$79)),ROW(62:62)),5))","v":""},{"$f":"IF(ISERROR(INDEX($A$1:$G$79,SMALL(IF($A$1:$A$79=$I$1,ROW($A$1:$A$79)),ROW(62:62)),6)),\"\",INDEX($A$1:$G$79,SMALL(IF($A$1:$A$79=$I$1,ROW($A$1:$A$79)),ROW(62:62)),6))","v":""},{"$f":"IF(ISERROR(INDEX($A$1:$H$79,SMALL(IF($A$1:$A$79=$I$1,ROW($A$1:$A$79)),ROW(62:62)),8)),\"\",INDEX($A$1:$H$79,SMALL(IF($A$1:$A$79=$I$1,ROW($A$1:$A$79)),ROW(62:62)),8))","v":""},{"$f":"IF(ISERROR(INDEX($A$1:$G$79,SMALL(IF($B$1:$B$79=$N$1,ROW($B$1:$B$79)),ROW(62:62)),6)),\"\",INDEX($A$1:$G$79,SMALL(IF($B$1:$B$79=$N$1,ROW($B$1:$B$79)),ROW(62:62)),6))","v":""},{"$f":"IF(ISERROR(INDEX($A$1:$G$79,SMALL(IF($B$1:$B$79=$N$1,ROW($B$1:$B$79)),ROW(62:62)),4)),\"\",INDEX($A$1:$G$79,SMALL(IF($B$1:$B$79=$N$1,ROW($B$1:$B$79)),ROW(62:62)),4))","v":""},{"$f":"IF(ISERROR(INDEX($A$1:$G$79,SMALL(IF($B$1:$B$79=$N$1,ROW($B$1:$B$79)),ROW(62:62)),5)),\"\",INDEX($A$1:$G$79,SMALL(IF($B$1:$B$79=$N$1,ROW($B$1:$B$79)),ROW(62:62)),5))","v":""},{"$f":"IF(ISERROR(INDEX($A$1:$G$79,SMALL(IF($B$1:$B$79=$N$1,ROW($B$1:$B$79)),ROW(62:62)),7)),\"\",INDEX($A$1:$G$79,SMALL(IF($B$1:$B$79=$N$1,ROW($B$1:$B$79)),ROW(62:62)),7))","v":""},{"$f":"IF(ISERROR(INDEX($A$1:$H$79,SMALL(IF($B$1:$B$79=$N$1,ROW($B$1:$B$79)),ROW(62:62)),8)),\"\",INDEX($A$1:$H$79,SMALL(IF($B$1:$B$79=$N$1,ROW($B$1:$B$79)),ROW(62:62)),8))","v":""},{"$f":"IF(ISERROR(INDEX($A$1:$G$79,SMALL(IF($C$1:$C$79=$S$1,ROW($C$1:$C$79)),ROW(62:62)),6)),\"\",INDEX($A$1:$G$79,SMALL(IF($C$1:$C$79=$S$1,ROW($C$1:$C$79)),ROW(62:62)),6))","v":""},{"$f":"IF(ISERROR(INDEX($A$1:$G$79,SMALL(IF($C$1:$C$79=$S$1,ROW($C$1:$C$79)),ROW(62:62)),4)),\"\",INDEX($A$1:$G$79,SMALL(IF($C$1:$C$79=$S$1,ROW($C$1:$C$79)),ROW(62:62)),4))","v":""},{"$f":"IF(ISERROR(INDEX($A$1:$G$79,SMALL(IF($C$1:$C$79=$S$1,ROW($C$1:$C$79)),ROW(62:62)),5)),\"\",INDEX($A$1:$G$79,SMALL(IF($C$1:$C$79=$S$1,ROW($C$1:$C$79)),ROW(62:62)),5))","v":""},{"$f":"IF(ISERROR(INDEX($A$1:$G$79,SMALL(IF($C$1:$C$79=$S$1,ROW($C$1:$C$79)),ROW(62:62)),7)),\"\",INDEX($A$1:$G$79,SMALL(IF($C$1:$C$79=$S$1,ROW($C$1:$C$79)),ROW(62:62)),7))","v":""},{"$f":"IF(ISERROR(INDEX($A$1:$H$79,SMALL(IF($C$1:$C$79=$S$1,ROW($C$1:$C$79)),ROW(62:62)),8)),\"\",INDEX($A$1:$H$79,SMALL(IF($C$1:$C$79=$S$1,ROW($C$1:$C$79)),ROW(62:62)),8))","v":""}," "]
[{"$f":"'Project Specific'!F15","v":"Please select answer"},{"$f":"'Project Specific'!G15","v":"Please select answer"},{"$f":"'Project Specific'!H15","v":"Please select answer"},{"$f":"'Project Specific'!B15","v":5},{"$f":"'Project Specific'!C15","v":"TH projects provide appropriate services"},{"$f":"'Project Specific'!D15","v":"TH projects provide appropriate services to meet the participants health and safety needs (e.g., persons in early recovery; domestic violence survivors; those who need special accommodations) when there are no permanent housing solutions available (with or without supportive services) or when the participant chooses transitional housing. Services are not required in order to participate in housing."},"Project-specific",{"$f":"F65","v":"Optional notes here"},{"$f":"IF(ISERROR(INDEX($A$1:$G$79,SMALL(IF($A$1:$A$79=$I$1,ROW($A$1:$A$79)),ROW(63:63)),7)),\"\",INDEX($A$1:$G$79,SMALL(IF($A$1:$A$79=$I$1,ROW($A$1:$A$79)),ROW(63:63)),7))","v":""},{"$f":"IF(ISERROR(INDEX($A$1:$G$79,SMALL(IF($A$1:$A$79=$I$1,ROW($A$1:$A$79)),ROW(63:63)),4)),\"\",INDEX($A$1:$G$79,SMALL(IF($A$1:$A$79=$I$1,ROW($A$1:$A$79)),ROW(63:63)),4))","v":""},{"$f":"IF(ISERROR(INDEX($A$1:$G$79,SMALL(IF($A$1:$A$79=$I$1,ROW($A$1:$A$79)),ROW(63:63)),5)),\"\",INDEX($A$1:$G$79,SMALL(IF($A$1:$A$79=$I$1,ROW($A$1:$A$79)),ROW(63:63)),5))","v":""},{"$f":"IF(ISERROR(INDEX($A$1:$G$79,SMALL(IF($A$1:$A$79=$I$1,ROW($A$1:$A$79)),ROW(63:63)),6)),\"\",INDEX($A$1:$G$79,SMALL(IF($A$1:$A$79=$I$1,ROW($A$1:$A$79)),ROW(63:63)),6))","v":""},{"$f":"IF(ISERROR(INDEX($A$1:$H$79,SMALL(IF($A$1:$A$79=$I$1,ROW($A$1:$A$79)),ROW(63:63)),8)),\"\",INDEX($A$1:$H$79,SMALL(IF($A$1:$A$79=$I$1,ROW($A$1:$A$79)),ROW(63:63)),8))","v":""},{"$f":"IF(ISERROR(INDEX($A$1:$G$79,SMALL(IF($B$1:$B$79=$N$1,ROW($B$1:$B$79)),ROW(63:63)),6)),\"\",INDEX($A$1:$G$79,SMALL(IF($B$1:$B$79=$N$1,ROW($B$1:$B$79)),ROW(63:63)),6))","v":""},{"$f":"IF(ISERROR(INDEX($A$1:$G$79,SMALL(IF($B$1:$B$79=$N$1,ROW($B$1:$B$79)),ROW(63:63)),4)),\"\",INDEX($A$1:$G$79,SMALL(IF($B$1:$B$79=$N$1,ROW($B$1:$B$79)),ROW(63:63)),4))","v":""},{"$f":"IF(ISERROR(INDEX($A$1:$G$79,SMALL(IF($B$1:$B$79=$N$1,ROW($B$1:$B$79)),ROW(63:63)),5)),\"\",INDEX($A$1:$G$79,SMALL(IF($B$1:$B$79=$N$1,ROW($B$1:$B$79)),ROW(63:63)),5))","v":""},{"$f":"IF(ISERROR(INDEX($A$1:$G$79,SMALL(IF($B$1:$B$79=$N$1,ROW($B$1:$B$79)),ROW(63:63)),7)),\"\",INDEX($A$1:$G$79,SMALL(IF($B$1:$B$79=$N$1,ROW($B$1:$B$79)),ROW(63:63)),7))","v":""},{"$f":"IF(ISERROR(INDEX($A$1:$H$79,SMALL(IF($B$1:$B$79=$N$1,ROW($B$1:$B$79)),ROW(63:63)),8)),\"\",INDEX($A$1:$H$79,SMALL(IF($B$1:$B$79=$N$1,ROW($B$1:$B$79)),ROW(63:63)),8))","v":""},{"$f":"IF(ISERROR(INDEX($A$1:$G$79,SMALL(IF($C$1:$C$79=$S$1,ROW($C$1:$C$79)),ROW(63:63)),6)),\"\",INDEX($A$1:$G$79,SMALL(IF($C$1:$C$79=$S$1,ROW($C$1:$C$79)),ROW(63:63)),6))","v":""},{"$f":"IF(ISERROR(INDEX($A$1:$G$79,SMALL(IF($C$1:$C$79=$S$1,ROW($C$1:$C$79)),ROW(63:63)),4)),\"\",INDEX($A$1:$G$79,SMALL(IF($C$1:$C$79=$S$1,ROW($C$1:$C$79)),ROW(63:63)),4))","v":""},{"$f":"IF(ISERROR(INDEX($A$1:$G$79,SMALL(IF($C$1:$C$79=$S$1,ROW($C$1:$C$79)),ROW(63:63)),5)),\"\",INDEX($A$1:$G$79,SMALL(IF($C$1:$C$79=$S$1,ROW($C$1:$C$79)),ROW(63:63)),5))","v":""},{"$f":"IF(ISERROR(INDEX($A$1:$G$79,SMALL(IF($C$1:$C$79=$S$1,ROW($C$1:$C$79)),ROW(63:63)),7)),\"\",INDEX($A$1:$G$79,SMALL(IF($C$1:$C$79=$S$1,ROW($C$1:$C$79)),ROW(63:63)),7))","v":""},{"$f":"IF(ISERROR(INDEX($A$1:$H$79,SMALL(IF($C$1:$C$79=$S$1,ROW($C$1:$C$79)),ROW(63:63)),8)),\"\",INDEX($A$1:$H$79,SMALL(IF($C$1:$C$79=$S$1,ROW($C$1:$C$79)),ROW(63:63)),8))","v":""}," "]
[{"$f":"'Project Specific'!F16","v":0},{"$f":"'Project Specific'!G16","v":0},{"$f":"'Project Specific'!H16","v":0},{"$f":"'Project Specific'!B16","v":0},{"$f":"'Project Specific'!C16","v":0},{"$f":"'Project Specific'!D16","v":"Optional notes here"},"Project-specific",0,{"$f":"IF(ISERROR(INDEX($A$1:$G$79,SMALL(IF($A$1:$A$79=$I$1,ROW($A$1:$A$79)),ROW(64:64)),7)),\"\",INDEX($A$1:$G$79,SMALL(IF($A$1:$A$79=$I$1,ROW($A$1:$A$79)),ROW(64:64)),7))","v":""},{"$f":"IF(ISERROR(INDEX($A$1:$G$79,SMALL(IF($A$1:$A$79=$I$1,ROW($A$1:$A$79)),ROW(64:64)),4)),\"\",INDEX($A$1:$G$79,SMALL(IF($A$1:$A$79=$I$1,ROW($A$1:$A$79)),ROW(64:64)),4))","v":""},{"$f":"IF(ISERROR(INDEX($A$1:$G$79,SMALL(IF($A$1:$A$79=$I$1,ROW($A$1:$A$79)),ROW(64:64)),5)),\"\",INDEX($A$1:$G$79,SMALL(IF($A$1:$A$79=$I$1,ROW($A$1:$A$79)),ROW(64:64)),5))","v":""},{"$f":"IF(ISERROR(INDEX($A$1:$G$79,SMALL(IF($A$1:$A$79=$I$1,ROW($A$1:$A$79)),ROW(64:64)),6)),\"\",INDEX($A$1:$G$79,SMALL(IF($A$1:$A$79=$I$1,ROW($A$1:$A$79)),ROW(64:64)),6))","v":""},{"$f":"IF(ISERROR(INDEX($A$1:$H$79,SMALL(IF($A$1:$A$79=$I$1,ROW($A$1:$A$79)),ROW(64:64)),8)),\"\",INDEX($A$1:$H$79,SMALL(IF($A$1:$A$79=$I$1,ROW($A$1:$A$79)),ROW(64:64)),8))","v":""},{"$f":"IF(ISERROR(INDEX($A$1:$G$79,SMALL(IF($B$1:$B$79=$N$1,ROW($B$1:$B$79)),ROW(64:64)),6)),\"\",INDEX($A$1:$G$79,SMALL(IF($B$1:$B$79=$N$1,ROW($B$1:$B$79)),ROW(64:64)),6))","v":""},{"$f":"IF(ISERROR(INDEX($A$1:$G$79,SMALL(IF($B$1:$B$79=$N$1,ROW($B$1:$B$79)),ROW(64:64)),4)),\"\",INDEX($A$1:$G$79,SMALL(IF($B$1:$B$79=$N$1,ROW($B$1:$B$79)),ROW(64:64)),4))","v":""},{"$f":"IF(ISERROR(INDEX($A$1:$G$79,SMALL(IF($B$1:$B$79=$N$1,ROW($B$1:$B$79)),ROW(64:64)),5)),\"\",INDEX($A$1:$G$79,SMALL(IF($B$1:$B$79=$N$1,ROW($B$1:$B$79)),ROW(64:64)),5))","v":""},{"$f":"IF(ISERROR(INDEX($A$1:$G$79,SMALL(IF($B$1:$B$79=$N$1,ROW($B$1:$B$79)),ROW(64:64)),7)),\"\",INDEX($A$1:$G$79,SMALL(IF($B$1:$B$79=$N$1,ROW($B$1:$B$79)),ROW(64:64)),7))","v":""},{"$f":"IF(ISERROR(INDEX($A$1:$H$79,SMALL(IF($B$1:$B$79=$N$1,ROW($B$1:$B$79)),ROW(64:64)),8)),\"\",INDEX($A$1:$H$79,SMALL(IF($B$1:$B$79=$N$1,ROW($B$1:$B$79)),ROW(64:64)),8))","v":""},{"$f":"IF(ISERROR(INDEX($A$1:$G$79,SMALL(IF($C$1:$C$79=$S$1,ROW($C$1:$C$79)),ROW(64:64)),6)),\"\",INDEX($A$1:$G$79,SMALL(IF($C$1:$C$79=$S$1,ROW($C$1:$C$79)),ROW(64:64)),6))","v":""},{"$f":"IF(ISERROR(INDEX($A$1:$G$79,SMALL(IF($C$1:$C$79=$S$1,ROW($C$1:$C$79)),ROW(64:64)),4)),\"\",INDEX($A$1:$G$79,SMALL(IF($C$1:$C$79=$S$1,ROW($C$1:$C$79)),ROW(64:64)),4))","v":""},{"$f":"IF(ISERROR(INDEX($A$1:$G$79,SMALL(IF($C$1:$C$79=$S$1,ROW($C$1:$C$79)),ROW(64:64)),5)),\"\",INDEX($A$1:$G$79,SMALL(IF($C$1:$C$79=$S$1,ROW($C$1:$C$79)),ROW(64:64)),5))","v":""},{"$f":"IF(ISERROR(INDEX($A$1:$G$79,SMALL(IF($C$1:$C$79=$S$1,ROW($C$1:$C$79)),ROW(64:64)),7)),\"\",INDEX($A$1:$G$79,SMALL(IF($C$1:$C$79=$S$1,ROW($C$1:$C$79)),ROW(64:64)),7))","v":""},{"$f":"IF(ISERROR(INDEX($A$1:$H$79,SMALL(IF($C$1:$C$79=$S$1,ROW($C$1:$C$79)),ROW(64:64)),8)),\"\",INDEX($A$1:$H$79,SMALL(IF($C$1:$C$79=$S$1,ROW($C$1:$C$79)),ROW(64:64)),8))","v":""}," "]
[{"$f":"'Project Specific'!F17","v":"Please select answer"},{"$f":"'Project Specific'!G17","v":"Please select answer"},{"$f":"'Project Specific'!H17","v":"Please select answer"},{"$f":"'Project Specific'!B17","v":""},{"$f":"'Project Specific'!C17","v":" "},{"$f":"'Project Specific'!D17","v":"No additional standards"},"Project-specific",{"$f":"F67","v":"Optional notes here"},{"$f":"IF(ISERROR(INDEX($A$1:$G$79,SMALL(IF($A$1:$A$79=$I$1,ROW($A$1:$A$79)),ROW(65:65)),7)),\"\",INDEX($A$1:$G$79,SMALL(IF($A$1:$A$79=$I$1,ROW($A$1:$A$79)),ROW(65:65)),7))","v":""},{"$f":"IF(ISERROR(INDEX($A$1:$G$79,SMALL(IF($A$1:$A$79=$I$1,ROW($A$1:$A$79)),ROW(65:65)),4)),\"\",INDEX($A$1:$G$79,SMALL(IF($A$1:$A$79=$I$1,ROW($A$1:$A$79)),ROW(65:65)),4))","v":""},{"$f":"IF(ISERROR(INDEX($A$1:$G$79,SMALL(IF($A$1:$A$79=$I$1,ROW($A$1:$A$79)),ROW(65:65)),5)),\"\",INDEX($A$1:$G$79,SMALL(IF($A$1:$A$79=$I$1,ROW($A$1:$A$79)),ROW(65:65)),5))","v":""},{"$f":"IF(ISERROR(INDEX($A$1:$G$79,SMALL(IF($A$1:$A$79=$I$1,ROW($A$1:$A$79)),ROW(65:65)),6)),\"\",INDEX($A$1:$G$79,SMALL(IF($A$1:$A$79=$I$1,ROW($A$1:$A$79)),ROW(65:65)),6))","v":""},{"$f":"IF(ISERROR(INDEX($A$1:$H$79,SMALL(IF($A$1:$A$79=$I$1,ROW($A$1:$A$79)),ROW(65:65)),8)),\"\",INDEX($A$1:$H$79,SMALL(IF($A$1:$A$79=$I$1,ROW($A$1:$A$79)),ROW(65:65)),8))","v":""},{"$f":"IF(ISERROR(INDEX($A$1:$G$79,SMALL(IF($B$1:$B$79=$N$1,ROW($B$1:$B$79)),ROW(65:65)),6)),\"\",INDEX($A$1:$G$79,SMALL(IF($B$1:$B$79=$N$1,ROW($B$1:$B$79)),ROW(65:65)),6))","v":""},{"$f":"IF(ISERROR(INDEX($A$1:$G$79,SMALL(IF($B$1:$B$79=$N$1,ROW($B$1:$B$79)),ROW(65:65)),4)),\"\",INDEX($A$1:$G$79,SMALL(IF($B$1:$B$79=$N$1,ROW($B$1:$B$79)),ROW(65:65)),4))","v":""},{"$f":"IF(ISERROR(INDEX($A$1:$G$79,SMALL(IF($B$1:$B$79=$N$1,ROW($B$1:$B$79)),ROW(65:65)),5)),\"\",INDEX($A$1:$G$79,SMALL(IF($B$1:$B$79=$N$1,ROW($B$1:$B$79)),ROW(65:65)),5))","v":""},{"$f":"IF(ISERROR(INDEX($A$1:$G$79,SMALL(IF($B$1:$B$79=$N$1,ROW($B$1:$B$79)),ROW(65:65)),7)),\"\",INDEX($A$1:$G$79,SMALL(IF($B$1:$B$79=$N$1,ROW($B$1:$B$79)),ROW(65:65)),7))","v":""},{"$f":"IF(ISERROR(INDEX($A$1:$H$79,SMALL(IF($B$1:$B$79=$N$1,ROW($B$1:$B$79)),ROW(65:65)),8)),\"\",INDEX($A$1:$H$79,SMALL(IF($B$1:$B$79=$N$1,ROW($B$1:$B$79)),ROW(65:65)),8))","v":""},{"$f":"IF(ISERROR(INDEX($A$1:$G$79,SMALL(IF($C$1:$C$79=$S$1,ROW($C$1:$C$79)),ROW(65:65)),6)),\"\",INDEX($A$1:$G$79,SMALL(IF($C$1:$C$79=$S$1,ROW($C$1:$C$79)),ROW(65:65)),6))","v":""},{"$f":"IF(ISERROR(INDEX($A$1:$G$79,SMALL(IF($C$1:$C$79=$S$1,ROW($C$1:$C$79)),ROW(65:65)),4)),\"\",INDEX($A$1:$G$79,SMALL(IF($C$1:$C$79=$S$1,ROW($C$1:$C$79)),ROW(65:65)),4))","v":""},{"$f":"IF(ISERROR(INDEX($A$1:$G$79,SMALL(IF($C$1:$C$79=$S$1,ROW($C$1:$C$79)),ROW(65:65)),5)),\"\",INDEX($A$1:$G$79,SMALL(IF($C$1:$C$79=$S$1,ROW($C$1:$C$79)),ROW(65:65)),5))","v":""},{"$f":"IF(ISERROR(INDEX($A$1:$G$79,SMALL(IF($C$1:$C$79=$S$1,ROW($C$1:$C$79)),ROW(65:65)),7)),\"\",INDEX($A$1:$G$79,SMALL(IF($C$1:$C$79=$S$1,ROW($C$1:$C$79)),ROW(65:65)),7))","v":""},{"$f":"IF(ISERROR(INDEX($A$1:$H$79,SMALL(IF($C$1:$C$79=$S$1,ROW($C$1:$C$79)),ROW(65:65)),8)),\"\",INDEX($A$1:$H$79,SMALL(IF($C$1:$C$79=$S$1,ROW($C$1:$C$79)),ROW(65:65)),8))","v":""}," "]
[{"$f":"'Project Specific'!F18","v":0},{"$f":"'Project Specific'!G18","v":0},{"$f":"'Project Specific'!H18","v":0},{"$f":"'Project Specific'!B18","v":0},{"$f":"'Project Specific'!C18","v":0},{"$f":"'Project Specific'!D18","v":"Optional notes here"},"Project-specific",0,{"$f":"IF(ISERROR(INDEX($A$1:$G$79,SMALL(IF($A$1:$A$79=$I$1,ROW($A$1:$A$79)),ROW(66:66)),7)),\"\",INDEX($A$1:$G$79,SMALL(IF($A$1:$A$79=$I$1,ROW($A$1:$A$79)),ROW(66:66)),7))","v":""},{"$f":"IF(ISERROR(INDEX($A$1:$G$79,SMALL(IF($A$1:$A$79=$I$1,ROW($A$1:$A$79)),ROW(66:66)),4)),\"\",INDEX($A$1:$G$79,SMALL(IF($A$1:$A$79=$I$1,ROW($A$1:$A$79)),ROW(66:66)),4))","v":""},{"$f":"IF(ISERROR(INDEX($A$1:$G$79,SMALL(IF($A$1:$A$79=$I$1,ROW($A$1:$A$79)),ROW(66:66)),5)),\"\",INDEX($A$1:$G$79,SMALL(IF($A$1:$A$79=$I$1,ROW($A$1:$A$79)),ROW(66:66)),5))","v":""},{"$f":"IF(ISERROR(INDEX($A$1:$G$79,SMALL(IF($A$1:$A$79=$I$1,ROW($A$1:$A$79)),ROW(66:66)),6)),\"\",INDEX($A$1:$G$79,SMALL(IF($A$1:$A$79=$I$1,ROW($A$1:$A$79)),ROW(66:66)),6))","v":""},{"$f":"IF(ISERROR(INDEX($A$1:$H$79,SMALL(IF($A$1:$A$79=$I$1,ROW($A$1:$A$79)),ROW(66:66)),8)),\"\",INDEX($A$1:$H$79,SMALL(IF($A$1:$A$79=$I$1,ROW($A$1:$A$79)),ROW(66:66)),8))","v":""},{"$f":"IF(ISERROR(INDEX($A$1:$G$79,SMALL(IF($B$1:$B$79=$N$1,ROW($B$1:$B$79)),ROW(66:66)),6)),\"\",INDEX($A$1:$G$79,SMALL(IF($B$1:$B$79=$N$1,ROW($B$1:$B$79)),ROW(66:66)),6))","v":""},{"$f":"IF(ISERROR(INDEX($A$1:$G$79,SMALL(IF($B$1:$B$79=$N$1,ROW($B$1:$B$79)),ROW(66:66)),4)),\"\",INDEX($A$1:$G$79,SMALL(IF($B$1:$B$79=$N$1,ROW($B$1:$B$79)),ROW(66:66)),4))","v":""},{"$f":"IF(ISERROR(INDEX($A$1:$G$79,SMALL(IF($B$1:$B$79=$N$1,ROW($B$1:$B$79)),ROW(66:66)),5)),\"\",INDEX($A$1:$G$79,SMALL(IF($B$1:$B$79=$N$1,ROW($B$1:$B$79)),ROW(66:66)),5))","v":""},{"$f":"IF(ISERROR(INDEX($A$1:$G$79,SMALL(IF($B$1:$B$79=$N$1,ROW($B$1:$B$79)),ROW(66:66)),7)),\"\",INDEX($A$1:$G$79,SMALL(IF($B$1:$B$79=$N$1,ROW($B$1:$B$79)),ROW(66:66)),7))","v":""},{"$f":"IF(ISERROR(INDEX($A$1:$H$79,SMALL(IF($B$1:$B$79=$N$1,ROW($B$1:$B$79)),ROW(66:66)),8)),\"\",INDEX($A$1:$H$79,SMALL(IF($B$1:$B$79=$N$1,ROW($B$1:$B$79)),ROW(66:66)),8))","v":""},{"$f":"IF(ISERROR(INDEX($A$1:$G$79,SMALL(IF($C$1:$C$79=$S$1,ROW($C$1:$C$79)),ROW(66:66)),6)),\"\",INDEX($A$1:$G$79,SMALL(IF($C$1:$C$79=$S$1,ROW($C$1:$C$79)),ROW(66:66)),6))","v":""},{"$f":"IF(ISERROR(INDEX($A$1:$G$79,SMALL(IF($C$1:$C$79=$S$1,ROW($C$1:$C$79)),ROW(66:66)),4)),\"\",INDEX($A$1:$G$79,SMALL(IF($C$1:$C$79=$S$1,ROW($C$1:$C$79)),ROW(66:66)),4))","v":""},{"$f":"IF(ISERROR(INDEX($A$1:$G$79,SMALL(IF($C$1:$C$79=$S$1,ROW($C$1:$C$79)),ROW(66:66)),5)),\"\",INDEX($A$1:$G$79,SMALL(IF($C$1:$C$79=$S$1,ROW($C$1:$C$79)),ROW(66:66)),5))","v":""},{"$f":"IF(ISERROR(INDEX($A$1:$G$79,SMALL(IF($C$1:$C$79=$S$1,ROW($C$1:$C$79)),ROW(66:66)),7)),\"\",INDEX($A$1:$G$79,SMALL(IF($C$1:$C$79=$S$1,ROW($C$1:$C$79)),ROW(66:66)),7))","v":""},{"$f":"IF(ISERROR(INDEX($A$1:$H$79,SMALL(IF($C$1:$C$79=$S$1,ROW($C$1:$C$79)),ROW(66:66)),8)),\"\",INDEX($A$1:$H$79,SMALL(IF($C$1:$C$79=$S$1,ROW($C$1:$C$79)),ROW(66:66)),8))","v":""}," "]
[{"$f":"'Project Specific'!F19","v":"Please select answer"},{"$f":"'Project Specific'!G19","v":"Please select answer"},{"$f":"'Project Specific'!H19","v":"Please select answer"},{"$f":"'Project Specific'!B19","v":""},{"$f":"'Project Specific'!C19","v":" "},{"$f":"'Project Specific'!D19","v":"No additional standards"},"Project-specific",{"$f":"F69","v":"Optional notes here"},{"$f":"IF(ISERROR(INDEX($A$1:$G$79,SMALL(IF($A$1:$A$79=$I$1,ROW($A$1:$A$79)),ROW(67:67)),7)),\"\",INDEX($A$1:$G$79,SMALL(IF($A$1:$A$79=$I$1,ROW($A$1:$A$79)),ROW(67:67)),7))","v":""},{"$f":"IF(ISERROR(INDEX($A$1:$G$79,SMALL(IF($A$1:$A$79=$I$1,ROW($A$1:$A$79)),ROW(67:67)),4)),\"\",INDEX($A$1:$G$79,SMALL(IF($A$1:$A$79=$I$1,ROW($A$1:$A$79)),ROW(67:67)),4))","v":""},{"$f":"IF(ISERROR(INDEX($A$1:$G$79,SMALL(IF($A$1:$A$79=$I$1,ROW($A$1:$A$79)),ROW(67:67)),5)),\"\",INDEX($A$1:$G$79,SMALL(IF($A$1:$A$79=$I$1,ROW($A$1:$A$79)),ROW(67:67)),5))","v":""},{"$f":"IF(ISERROR(INDEX($A$1:$G$79,SMALL(IF($A$1:$A$79=$I$1,ROW($A$1:$A$79)),ROW(67:67)),6)),\"\",INDEX($A$1:$G$79,SMALL(IF($A$1:$A$79=$I$1,ROW($A$1:$A$79)),ROW(67:67)),6))","v":""},{"$f":"IF(ISERROR(INDEX($A$1:$H$79,SMALL(IF($A$1:$A$79=$I$1,ROW($A$1:$A$79)),ROW(67:67)),8)),\"\",INDEX($A$1:$H$79,SMALL(IF($A$1:$A$79=$I$1,ROW($A$1:$A$79)),ROW(67:67)),8))","v":""},{"$f":"IF(ISERROR(INDEX($A$1:$G$79,SMALL(IF($B$1:$B$79=$N$1,ROW($B$1:$B$79)),ROW(67:67)),6)),\"\",INDEX($A$1:$G$79,SMALL(IF($B$1:$B$79=$N$1,ROW($B$1:$B$79)),ROW(67:67)),6))","v":""},{"$f":"IF(ISERROR(INDEX($A$1:$G$79,SMALL(IF($B$1:$B$79=$N$1,ROW($B$1:$B$79)),ROW(67:67)),4)),\"\",INDEX($A$1:$G$79,SMALL(IF($B$1:$B$79=$N$1,ROW($B$1:$B$79)),ROW(67:67)),4))","v":""},{"$f":"IF(ISERROR(INDEX($A$1:$G$79,SMALL(IF($B$1:$B$79=$N$1,ROW($B$1:$B$79)),ROW(67:67)),5)),\"\",INDEX($A$1:$G$79,SMALL(IF($B$1:$B$79=$N$1,ROW($B$1:$B$79)),ROW(67:67)),5))","v":""},{"$f":"IF(ISERROR(INDEX($A$1:$G$79,SMALL(IF($B$1:$B$79=$N$1,ROW($B$1:$B$79)),ROW(67:67)),7)),\"\",INDEX($A$1:$G$79,SMALL(IF($B$1:$B$79=$N$1,ROW($B$1:$B$79)),ROW(67:67)),7))","v":""},{"$f":"IF(ISERROR(INDEX($A$1:$H$79,SMALL(IF($B$1:$B$79=$N$1,ROW($B$1:$B$79)),ROW(67:67)),8)),\"\",INDEX($A$1:$H$79,SMALL(IF($B$1:$B$79=$N$1,ROW($B$1:$B$79)),ROW(67:67)),8))","v":""},{"$f":"IF(ISERROR(INDEX($A$1:$G$79,SMALL(IF($C$1:$C$79=$S$1,ROW($C$1:$C$79)),ROW(67:67)),6)),\"\",INDEX($A$1:$G$79,SMALL(IF($C$1:$C$79=$S$1,ROW($C$1:$C$79)),ROW(67:67)),6))","v":""},{"$f":"IF(ISERROR(INDEX($A$1:$G$79,SMALL(IF($C$1:$C$79=$S$1,ROW($C$1:$C$79)),ROW(67:67)),4)),\"\",INDEX($A$1:$G$79,SMALL(IF($C$1:$C$79=$S$1,ROW($C$1:$C$79)),ROW(67:67)),4))","v":""},{"$f":"IF(ISERROR(INDEX($A$1:$G$79,SMALL(IF($C$1:$C$79=$S$1,ROW($C$1:$C$79)),ROW(67:67)),5)),\"\",INDEX($A$1:$G$79,SMALL(IF($C$1:$C$79=$S$1,ROW($C$1:$C$79)),ROW(67:67)),5))","v":""},{"$f":"IF(ISERROR(INDEX($A$1:$G$79,SMALL(IF($C$1:$C$79=$S$1,ROW($C$1:$C$79)),ROW(67:67)),7)),\"\",INDEX($A$1:$G$79,SMALL(IF($C$1:$C$79=$S$1,ROW($C$1:$C$79)),ROW(67:67)),7))","v":""},{"$f":"IF(ISERROR(INDEX($A$1:$H$79,SMALL(IF($C$1:$C$79=$S$1,ROW($C$1:$C$79)),ROW(67:67)),8)),\"\",INDEX($A$1:$H$79,SMALL(IF($C$1:$C$79=$S$1,ROW($C$1:$C$79)),ROW(67:67)),8))","v":""}," "]
[{"$f":"'Project Specific'!F20","v":0},{"$f":"'Project Specific'!G20","v":0},{"$f":"'Project Specific'!H20","v":0},{"$f":"'Project Specific'!B20","v":0},{"$f":"'Project Specific'!C20","v":0},{"$f":"'Project Specific'!D20","v":"Optional notes here"},"Project-specific",0,{"$f":"IF(ISERROR(INDEX($A$1:$G$79,SMALL(IF($A$1:$A$79=$I$1,ROW($A$1:$A$79)),ROW(68:68)),7)),\"\",INDEX($A$1:$G$79,SMALL(IF($A$1:$A$79=$I$1,ROW($A$1:$A$79)),ROW(68:68)),7))","v":""},{"$f":"IF(ISERROR(INDEX($A$1:$G$79,SMALL(IF($A$1:$A$79=$I$1,ROW($A$1:$A$79)),ROW(68:68)),4)),\"\",INDEX($A$1:$G$79,SMALL(IF($A$1:$A$79=$I$1,ROW($A$1:$A$79)),ROW(68:68)),4))","v":""},{"$f":"IF(ISERROR(INDEX($A$1:$G$79,SMALL(IF($A$1:$A$79=$I$1,ROW($A$1:$A$79)),ROW(68:68)),5)),\"\",INDEX($A$1:$G$79,SMALL(IF($A$1:$A$79=$I$1,ROW($A$1:$A$79)),ROW(68:68)),5))","v":""},{"$f":"IF(ISERROR(INDEX($A$1:$G$79,SMALL(IF($A$1:$A$79=$I$1,ROW($A$1:$A$79)),ROW(68:68)),6)),\"\",INDEX($A$1:$G$79,SMALL(IF($A$1:$A$79=$I$1,ROW($A$1:$A$79)),ROW(68:68)),6))","v":""},{"$f":"IF(ISERROR(INDEX($A$1:$H$79,SMALL(IF($A$1:$A$79=$I$1,ROW($A$1:$A$79)),ROW(68:68)),8)),\"\",INDEX($A$1:$H$79,SMALL(IF($A$1:$A$79=$I$1,ROW($A$1:$A$79)),ROW(68:68)),8))","v":""},{"$f":"IF(ISERROR(INDEX($A$1:$G$79,SMALL(IF($B$1:$B$79=$N$1,ROW($B$1:$B$79)),ROW(68:68)),6)),\"\",INDEX($A$1:$G$79,SMALL(IF($B$1:$B$79=$N$1,ROW($B$1:$B$79)),ROW(68:68)),6))","v":""},{"$f":"IF(ISERROR(INDEX($A$1:$G$79,SMALL(IF($B$1:$B$79=$N$1,ROW($B$1:$B$79)),ROW(68:68)),4)),\"\",INDEX($A$1:$G$79,SMALL(IF($B$1:$B$79=$N$1,ROW($B$1:$B$79)),ROW(68:68)),4))","v":""},{"$f":"IF(ISERROR(INDEX($A$1:$G$79,SMALL(IF($B$1:$B$79=$N$1,ROW($B$1:$B$79)),ROW(68:68)),5)),\"\",INDEX($A$1:$G$79,SMALL(IF($B$1:$B$79=$N$1,ROW($B$1:$B$79)),ROW(68:68)),5))","v":""},{"$f":"IF(ISERROR(INDEX($A$1:$G$79,SMALL(IF($B$1:$B$79=$N$1,ROW($B$1:$B$79)),ROW(68:68)),7)),\"\",INDEX($A$1:$G$79,SMALL(IF($B$1:$B$79=$N$1,ROW($B$1:$B$79)),ROW(68:68)),7))","v":""},{"$f":"IF(ISERROR(INDEX($A$1:$H$79,SMALL(IF($B$1:$B$79=$N$1,ROW($B$1:$B$79)),ROW(68:68)),8)),\"\",INDEX($A$1:$H$79,SMALL(IF($B$1:$B$79=$N$1,ROW($B$1:$B$79)),ROW(68:68)),8))","v":""},{"$f":"IF(ISERROR(INDEX($A$1:$G$79,SMALL(IF($C$1:$C$79=$S$1,ROW($C$1:$C$79)),ROW(68:68)),6)),\"\",INDEX($A$1:$G$79,SMALL(IF($C$1:$C$79=$S$1,ROW($C$1:$C$79)),ROW(68:68)),6))","v":""},{"$f":"IF(ISERROR(INDEX($A$1:$G$79,SMALL(IF($C$1:$C$79=$S$1,ROW($C$1:$C$79)),ROW(68:68)),4)),\"\",INDEX($A$1:$G$79,SMALL(IF($C$1:$C$79=$S$1,ROW($C$1:$C$79)),ROW(68:68)),4))","v":""},{"$f":"IF(ISERROR(INDEX($A$1:$G$79,SMALL(IF($C$1:$C$79=$S$1,ROW($C$1:$C$79)),ROW(68:68)),5)),\"\",INDEX($A$1:$G$79,SMALL(IF($C$1:$C$79=$S$1,ROW($C$1:$C$79)),ROW(68:68)),5))","v":""},{"$f":"IF(ISERROR(INDEX($A$1:$G$79,SMALL(IF($C$1:$C$79=$S$1,ROW($C$1:$C$79)),ROW(68:68)),7)),\"\",INDEX($A$1:$G$79,SMALL(IF($C$1:$C$79=$S$1,ROW($C$1:$C$79)),ROW(68:68)),7))","v":""},{"$f":"IF(ISERROR(INDEX($A$1:$H$79,SMALL(IF($C$1:$C$79=$S$1,ROW($C$1:$C$79)),ROW(68:68)),8)),\"\",INDEX($A$1:$H$79,SMALL(IF($C$1:$C$79=$S$1,ROW($C$1:$C$79)),ROW(68:68)),8))","v":""}," "]
[{"$f":"'Project Specific'!F21","v":"Please select answer"},{"$f":"'Project Specific'!G21","v":"Please select answer"},{"$f":"'Project Specific'!H21","v":"Please select answer"},{"$f":"'Project Specific'!B21","v":""},{"$f":"'Project Specific'!C21","v":" "},{"$f":"'Project Specific'!D21","v":"No additional standards"},"Project-specific",{"$f":"F71","v":"Optional notes here"},{"$f":"IF(ISERROR(INDEX($A$1:$G$79,SMALL(IF($A$1:$A$79=$I$1,ROW($A$1:$A$79)),ROW(69:69)),7)),\"\",INDEX($A$1:$G$79,SMALL(IF($A$1:$A$79=$I$1,ROW($A$1:$A$79)),ROW(69:69)),7))","v":""},{"$f":"IF(ISERROR(INDEX($A$1:$G$79,SMALL(IF($A$1:$A$79=$I$1,ROW($A$1:$A$79)),ROW(69:69)),4)),\"\",INDEX($A$1:$G$79,SMALL(IF($A$1:$A$79=$I$1,ROW($A$1:$A$79)),ROW(69:69)),4))","v":""},{"$f":"IF(ISERROR(INDEX($A$1:$G$79,SMALL(IF($A$1:$A$79=$I$1,ROW($A$1:$A$79)),ROW(69:69)),5)),\"\",INDEX($A$1:$G$79,SMALL(IF($A$1:$A$79=$I$1,ROW($A$1:$A$79)),ROW(69:69)),5))","v":""},{"$f":"IF(ISERROR(INDEX($A$1:$G$79,SMALL(IF($A$1:$A$79=$I$1,ROW($A$1:$A$79)),ROW(69:69)),6)),\"\",INDEX($A$1:$G$79,SMALL(IF($A$1:$A$79=$I$1,ROW($A$1:$A$79)),ROW(69:69)),6))","v":""},{"$f":"IF(ISERROR(INDEX($A$1:$H$79,SMALL(IF($A$1:$A$79=$I$1,ROW($A$1:$A$79)),ROW(69:69)),8)),\"\",INDEX($A$1:$H$79,SMALL(IF($A$1:$A$79=$I$1,ROW($A$1:$A$79)),ROW(69:69)),8))","v":""},{"$f":"IF(ISERROR(INDEX($A$1:$G$79,SMALL(IF($B$1:$B$79=$N$1,ROW($B$1:$B$79)),ROW(69:69)),6)),\"\",INDEX($A$1:$G$79,SMALL(IF($B$1:$B$79=$N$1,ROW($B$1:$B$79)),ROW(69:69)),6))","v":""},{"$f":"IF(ISERROR(INDEX($A$1:$G$79,SMALL(IF($B$1:$B$79=$N$1,ROW($B$1:$B$79)),ROW(69:69)),4)),\"\",INDEX($A$1:$G$79,SMALL(IF($B$1:$B$79=$N$1,ROW($B$1:$B$79)),ROW(69:69)),4))","v":""},{"$f":"IF(ISERROR(INDEX($A$1:$G$79,SMALL(IF($B$1:$B$79=$N$1,ROW($B$1:$B$79)),ROW(69:69)),5)),\"\",INDEX($A$1:$G$79,SMALL(IF($B$1:$B$79=$N$1,ROW($B$1:$B$79)),ROW(69:69)),5))","v":""},{"$f":"IF(ISERROR(INDEX($A$1:$G$79,SMALL(IF($B$1:$B$79=$N$1,ROW($B$1:$B$79)),ROW(69:69)),7)),\"\",INDEX($A$1:$G$79,SMALL(IF($B$1:$B$79=$N$1,ROW($B$1:$B$79)),ROW(69:69)),7))","v":""},{"$f":"IF(ISERROR(INDEX($A$1:$H$79,SMALL(IF($B$1:$B$79=$N$1,ROW($B$1:$B$79)),ROW(69:69)),8)),\"\",INDEX($A$1:$H$79,SMALL(IF($B$1:$B$79=$N$1,ROW($B$1:$B$79)),ROW(69:69)),8))","v":""},{"$f":"IF(ISERROR(INDEX($A$1:$G$79,SMALL(IF($C$1:$C$79=$S$1,ROW($C$1:$C$79)),ROW(69:69)),6)),\"\",INDEX($A$1:$G$79,SMALL(IF($C$1:$C$79=$S$1,ROW($C$1:$C$79)),ROW(69:69)),6))","v":""},{"$f":"IF(ISERROR(INDEX($A$1:$G$79,SMALL(IF($C$1:$C$79=$S$1,ROW($C$1:$C$79)),ROW(69:69)),4)),\"\",INDEX($A$1:$G$79,SMALL(IF($C$1:$C$79=$S$1,ROW($C$1:$C$79)),ROW(69:69)),4))","v":""},{"$f":"IF(ISERROR(INDEX($A$1:$G$79,SMALL(IF($C$1:$C$79=$S$1,ROW($C$1:$C$79)),ROW(69:69)),5)),\"\",INDEX($A$1:$G$79,SMALL(IF($C$1:$C$79=$S$1,ROW($C$1:$C$79)),ROW(69:69)),5))","v":""},{"$f":"IF(ISERROR(INDEX($A$1:$G$79,SMALL(IF($C$1:$C$79=$S$1,ROW($C$1:$C$79)),ROW(69:69)),7)),\"\",INDEX($A$1:$G$79,SMALL(IF($C$1:$C$79=$S$1,ROW($C$1:$C$79)),ROW(69:69)),7))","v":""},{"$f":"IF(ISERROR(INDEX($A$1:$H$79,SMALL(IF($C$1:$C$79=$S$1,ROW($C$1:$C$79)),ROW(69:69)),8)),\"\",INDEX($A$1:$H$79,SMALL(IF($C$1:$C$79=$S$1,ROW($C$1:$C$79)),ROW(69:69)),8))","v":""}," "]
[{"$f":"'Project Specific'!F22","v":0},{"$f":"'Project Specific'!G22","v":0},{"$f":"'Project Specific'!H22","v":0},{"$f":"'Project Specific'!B22","v":0},{"$f":"'Project Specific'!C22","v":0},{"$f":"'Project Specific'!D22","v":"Optional notes here"},"Project-specific",0,{"$f":"IF(ISERROR(INDEX($A$1:$G$79,SMALL(IF($A$1:$A$79=$I$1,ROW($A$1:$A$79)),ROW(70:70)),7)),\"\",INDEX($A$1:$G$79,SMALL(IF($A$1:$A$79=$I$1,ROW($A$1:$A$79)),ROW(70:70)),7))","v":""},{"$f":"IF(ISERROR(INDEX($A$1:$G$79,SMALL(IF($A$1:$A$79=$I$1,ROW($A$1:$A$79)),ROW(70:70)),4)),\"\",INDEX($A$1:$G$79,SMALL(IF($A$1:$A$79=$I$1,ROW($A$1:$A$79)),ROW(70:70)),4))","v":""},{"$f":"IF(ISERROR(INDEX($A$1:$G$79,SMALL(IF($A$1:$A$79=$I$1,ROW($A$1:$A$79)),ROW(70:70)),5)),\"\",INDEX($A$1:$G$79,SMALL(IF($A$1:$A$79=$I$1,ROW($A$1:$A$79)),ROW(70:70)),5))","v":""},{"$f":"IF(ISERROR(INDEX($A$1:$G$79,SMALL(IF($A$1:$A$79=$I$1,ROW($A$1:$A$79)),ROW(70:70)),6)),\"\",INDEX($A$1:$G$79,SMALL(IF($A$1:$A$79=$I$1,ROW($A$1:$A$79)),ROW(70:70)),6))","v":""},{"$f":"IF(ISERROR(INDEX($A$1:$H$79,SMALL(IF($A$1:$A$79=$I$1,ROW($A$1:$A$79)),ROW(70:70)),8)),\"\",INDEX($A$1:$H$79,SMALL(IF($A$1:$A$79=$I$1,ROW($A$1:$A$79)),ROW(70:70)),8))","v":""},{"$f":"IF(ISERROR(INDEX($A$1:$G$79,SMALL(IF($B$1:$B$79=$N$1,ROW($B$1:$B$79)),ROW(70:70)),6)),\"\",INDEX($A$1:$G$79,SMALL(IF($B$1:$B$79=$N$1,ROW($B$1:$B$79)),ROW(70:70)),6))","v":""},{"$f":"IF(ISERROR(INDEX($A$1:$G$79,SMALL(IF($B$1:$B$79=$N$1,ROW($B$1:$B$79)),ROW(70:70)),4)),\"\",INDEX($A$1:$G$79,SMALL(IF($B$1:$B$79=$N$1,ROW($B$1:$B$79)),ROW(70:70)),4))","v":""},{"$f":"IF(ISERROR(INDEX($A$1:$G$79,SMALL(IF($B$1:$B$79=$N$1,ROW($B$1:$B$79)),ROW(70:70)),5)),\"\",INDEX($A$1:$G$79,SMALL(IF($B$1:$B$79=$N$1,ROW($B$1:$B$79)),ROW(70:70)),5))","v":""},{"$f":"IF(ISERROR(INDEX($A$1:$G$79,SMALL(IF($B$1:$B$79=$N$1,ROW($B$1:$B$79)),ROW(70:70)),7)),\"\",INDEX($A$1:$G$79,SMALL(IF($B$1:$B$79=$N$1,ROW($B$1:$B$79)),ROW(70:70)),7))","v":""},{"$f":"IF(ISERROR(INDEX($A$1:$H$79,SMALL(IF($B$1:$B$79=$N$1,ROW($B$1:$B$79)),ROW(70:70)),8)),\"\",INDEX($A$1:$H$79,SMALL(IF($B$1:$B$79=$N$1,ROW($B$1:$B$79)),ROW(70:70)),8))","v":""},{"$f":"IF(ISERROR(INDEX($A$1:$G$79,SMALL(IF($C$1:$C$79=$S$1,ROW($C$1:$C$79)),ROW(70:70)),6)),\"\",INDEX($A$1:$G$79,SMALL(IF($C$1:$C$79=$S$1,ROW($C$1:$C$79)),ROW(70:70)),6))","v":""},{"$f":"IF(ISERROR(INDEX($A$1:$G$79,SMALL(IF($C$1:$C$79=$S$1,ROW($C$1:$C$79)),ROW(70:70)),4)),\"\",INDEX($A$1:$G$79,SMALL(IF($C$1:$C$79=$S$1,ROW($C$1:$C$79)),ROW(70:70)),4))","v":""},{"$f":"IF(ISERROR(INDEX($A$1:$G$79,SMALL(IF($C$1:$C$79=$S$1,ROW($C$1:$C$79)),ROW(70:70)),5)),\"\",INDEX($A$1:$G$79,SMALL(IF($C$1:$C$79=$S$1,ROW($C$1:$C$79)),ROW(70:70)),5))","v":""},{"$f":"IF(ISERROR(INDEX($A$1:$G$79,SMALL(IF($C$1:$C$79=$S$1,ROW($C$1:$C$79)),ROW(70:70)),7)),\"\",INDEX($A$1:$G$79,SMALL(IF($C$1:$C$79=$S$1,ROW($C$1:$C$79)),ROW(70:70)),7))","v":""},{"$f":"IF(ISERROR(INDEX($A$1:$H$79,SMALL(IF($C$1:$C$79=$S$1,ROW($C$1:$C$79)),ROW(70:70)),8)),\"\",INDEX($A$1:$H$79,SMALL(IF($C$1:$C$79=$S$1,ROW($C$1:$C$79)),ROW(70:70)),8))","v":""}," "]
[{"$f":"'Project Specific'!F24","v":"Please select answer"},{"$f":"'Project Specific'!G24","v":"Please select answer"},{"$f":"'Project Specific'!H24","v":"Please select answer"},{"$f":"'Project Specific'!B24","v":1},{"$f":"'Project Specific'!C24","v":"Recovery housing is offered as one choice among other housing opportunities"},{"$f":"'Project Specific'!D24","v":"Connection to recovery housing reflects individual choice for this path toward recovery. Abstinence-only spaces are incorporated into a Housing First model wherever possible, thus providing this type of recovery option to those who choose it. Recovery supports are offered, particularly connections to community-based treatment options."},"Population",{"$f":"F73","v":"Optional notes here"},{"$f":"IF(ISERROR(INDEX($A$1:$G$79,SMALL(IF($A$1:$A$79=$I$1,ROW($A$1:$A$79)),ROW(71:71)),7)),\"\",INDEX($A$1:$G$79,SMALL(IF($A$1:$A$79=$I$1,ROW($A$1:$A$79)),ROW(71:71)),7))","v":""},{"$f":"IF(ISERROR(INDEX($A$1:$G$79,SMALL(IF($A$1:$A$79=$I$1,ROW($A$1:$A$79)),ROW(71:71)),4)),\"\",INDEX($A$1:$G$79,SMALL(IF($A$1:$A$79=$I$1,ROW($A$1:$A$79)),ROW(71:71)),4))","v":""},{"$f":"IF(ISERROR(INDEX($A$1:$G$79,SMALL(IF($A$1:$A$79=$I$1,ROW($A$1:$A$79)),ROW(71:71)),5)),\"\",INDEX($A$1:$G$79,SMALL(IF($A$1:$A$79=$I$1,ROW($A$1:$A$79)),ROW(71:71)),5))","v":""},{"$f":"IF(ISERROR(INDEX($A$1:$G$79,SMALL(IF($A$1:$A$79=$I$1,ROW($A$1:$A$79)),ROW(71:71)),6)),\"\",INDEX($A$1:$G$79,SMALL(IF($A$1:$A$79=$I$1,ROW($A$1:$A$79)),ROW(71:71)),6))","v":""},{"$f":"IF(ISERROR(INDEX($A$1:$H$79,SMALL(IF($A$1:$A$79=$I$1,ROW($A$1:$A$79)),ROW(71:71)),8)),\"\",INDEX($A$1:$H$79,SMALL(IF($A$1:$A$79=$I$1,ROW($A$1:$A$79)),ROW(71:71)),8))","v":""},{"$f":"IF(ISERROR(INDEX($A$1:$G$79,SMALL(IF($B$1:$B$79=$N$1,ROW($B$1:$B$79)),ROW(71:71)),6)),\"\",INDEX($A$1:$G$79,SMALL(IF($B$1:$B$79=$N$1,ROW($B$1:$B$79)),ROW(71:71)),6))","v":""},{"$f":"IF(ISERROR(INDEX($A$1:$G$79,SMALL(IF($B$1:$B$79=$N$1,ROW($B$1:$B$79)),ROW(71:71)),4)),\"\",INDEX($A$1:$G$79,SMALL(IF($B$1:$B$79=$N$1,ROW($B$1:$B$79)),ROW(71:71)),4))","v":""},{"$f":"IF(ISERROR(INDEX($A$1:$G$79,SMALL(IF($B$1:$B$79=$N$1,ROW($B$1:$B$79)),ROW(71:71)),5)),\"\",INDEX($A$1:$G$79,SMALL(IF($B$1:$B$79=$N$1,ROW($B$1:$B$79)),ROW(71:71)),5))","v":""},{"$f":"IF(ISERROR(INDEX($A$1:$G$79,SMALL(IF($B$1:$B$79=$N$1,ROW($B$1:$B$79)),ROW(71:71)),7)),\"\",INDEX($A$1:$G$79,SMALL(IF($B$1:$B$79=$N$1,ROW($B$1:$B$79)),ROW(71:71)),7))","v":""},{"$f":"IF(ISERROR(INDEX($A$1:$H$79,SMALL(IF($B$1:$B$79=$N$1,ROW($B$1:$B$79)),ROW(71:71)),8)),\"\",INDEX($A$1:$H$79,SMALL(IF($B$1:$B$79=$N$1,ROW($B$1:$B$79)),ROW(71:71)),8))","v":""},{"$f":"IF(ISERROR(INDEX($A$1:$G$79,SMALL(IF($C$1:$C$79=$S$1,ROW($C$1:$C$79)),ROW(71:71)),6)),\"\",INDEX($A$1:$G$79,SMALL(IF($C$1:$C$79=$S$1,ROW($C$1:$C$79)),ROW(71:71)),6))","v":""},{"$f":"IF(ISERROR(INDEX($A$1:$G$79,SMALL(IF($C$1:$C$79=$S$1,ROW($C$1:$C$79)),ROW(71:71)),4)),\"\",INDEX($A$1:$G$79,SMALL(IF($C$1:$C$79=$S$1,ROW($C$1:$C$79)),ROW(71:71)),4))","v":""},{"$f":"IF(ISERROR(INDEX($A$1:$G$79,SMALL(IF($C$1:$C$79=$S$1,ROW($C$1:$C$79)),ROW(71:71)),5)),\"\",INDEX($A$1:$G$79,SMALL(IF($C$1:$C$79=$S$1,ROW($C$1:$C$79)),ROW(71:71)),5))","v":""},{"$f":"IF(ISERROR(INDEX($A$1:$G$79,SMALL(IF($C$1:$C$79=$S$1,ROW($C$1:$C$79)),ROW(71:71)),7)),\"\",INDEX($A$1:$G$79,SMALL(IF($C$1:$C$79=$S$1,ROW($C$1:$C$79)),ROW(71:71)),7))","v":""},{"$f":"IF(ISERROR(INDEX($A$1:$H$79,SMALL(IF($C$1:$C$79=$S$1,ROW($C$1:$C$79)),ROW(71:71)),8)),\"\",INDEX($A$1:$H$79,SMALL(IF($C$1:$C$79=$S$1,ROW($C$1:$C$79)),ROW(71:71)),8))","v":""}," "]
[{"$f":"'Project Specific'!F25","v":0},{"$f":"'Project Specific'!G25","v":0},{"$f":"'Project Specific'!H25","v":0},{"$f":"'Project Specific'!B25","v":0},{"$f":"'Project Specific'!C25","v":0},{"$f":"'Project Specific'!D25","v":"Optional notes here"},"Population",0,{"$f":"IF(ISERROR(INDEX($A$1:$G$79,SMALL(IF($A$1:$A$79=$I$1,ROW($A$1:$A$79)),ROW(72:72)),7)),\"\",INDEX($A$1:$G$79,SMALL(IF($A$1:$A$79=$I$1,ROW($A$1:$A$79)),ROW(72:72)),7))","v":""},{"$f":"IF(ISERROR(INDEX($A$1:$G$79,SMALL(IF($A$1:$A$79=$I$1,ROW($A$1:$A$79)),ROW(72:72)),4)),\"\",INDEX($A$1:$G$79,SMALL(IF($A$1:$A$79=$I$1,ROW($A$1:$A$79)),ROW(72:72)),4))","v":""},{"$f":"IF(ISERROR(INDEX($A$1:$G$79,SMALL(IF($A$1:$A$79=$I$1,ROW($A$1:$A$79)),ROW(72:72)),5)),\"\",INDEX($A$1:$G$79,SMALL(IF($A$1:$A$79=$I$1,ROW($A$1:$A$79)),ROW(72:72)),5))","v":""},{"$f":"IF(ISERROR(INDEX($A$1:$G$79,SMALL(IF($A$1:$A$79=$I$1,ROW($A$1:$A$79)),ROW(72:72)),6)),\"\",INDEX($A$1:$G$79,SMALL(IF($A$1:$A$79=$I$1,ROW($A$1:$A$79)),ROW(72:72)),6))","v":""},{"$f":"IF(ISERROR(INDEX($A$1:$H$79,SMALL(IF($A$1:$A$79=$I$1,ROW($A$1:$A$79)),ROW(72:72)),8)),\"\",INDEX($A$1:$H$79,SMALL(IF($A$1:$A$79=$I$1,ROW($A$1:$A$79)),ROW(72:72)),8))","v":""},{"$f":"IF(ISERROR(INDEX($A$1:$G$79,SMALL(IF($B$1:$B$79=$N$1,ROW($B$1:$B$79)),ROW(72:72)),6)),\"\",INDEX($A$1:$G$79,SMALL(IF($B$1:$B$79=$N$1,ROW($B$1:$B$79)),ROW(72:72)),6))","v":""},{"$f":"IF(ISERROR(INDEX($A$1:$G$79,SMALL(IF($B$1:$B$79=$N$1,ROW($B$1:$B$79)),ROW(72:72)),4)),\"\",INDEX($A$1:$G$79,SMALL(IF($B$1:$B$79=$N$1,ROW($B$1:$B$79)),ROW(72:72)),4))","v":""},{"$f":"IF(ISERROR(INDEX($A$1:$G$79,SMALL(IF($B$1:$B$79=$N$1,ROW($B$1:$B$79)),ROW(72:72)),5)),\"\",INDEX($A$1:$G$79,SMALL(IF($B$1:$B$79=$N$1,ROW($B$1:$B$79)),ROW(72:72)),5))","v":""},{"$f":"IF(ISERROR(INDEX($A$1:$G$79,SMALL(IF($B$1:$B$79=$N$1,ROW($B$1:$B$79)),ROW(72:72)),7)),\"\",INDEX($A$1:$G$79,SMALL(IF($B$1:$B$79=$N$1,ROW($B$1:$B$79)),ROW(72:72)),7))","v":""},{"$f":"IF(ISERROR(INDEX($A$1:$H$79,SMALL(IF($B$1:$B$79=$N$1,ROW($B$1:$B$79)),ROW(72:72)),8)),\"\",INDEX($A$1:$H$79,SMALL(IF($B$1:$B$79=$N$1,ROW($B$1:$B$79)),ROW(72:72)),8))","v":""},{"$f":"IF(ISERROR(INDEX($A$1:$G$79,SMALL(IF($C$1:$C$79=$S$1,ROW($C$1:$C$79)),ROW(72:72)),6)),\"\",INDEX($A$1:$G$79,SMALL(IF($C$1:$C$79=$S$1,ROW($C$1:$C$79)),ROW(72:72)),6))","v":""},{"$f":"IF(ISERROR(INDEX($A$1:$G$79,SMALL(IF($C$1:$C$79=$S$1,ROW($C$1:$C$79)),ROW(72:72)),4)),\"\",INDEX($A$1:$G$79,SMALL(IF($C$1:$C$79=$S$1,ROW($C$1:$C$79)),ROW(72:72)),4))","v":""},{"$f":"IF(ISERROR(INDEX($A$1:$G$79,SMALL(IF($C$1:$C$79=$S$1,ROW($C$1:$C$79)),ROW(72:72)),5)),\"\",INDEX($A$1:$G$79,SMALL(IF($C$1:$C$79=$S$1,ROW($C$1:$C$79)),ROW(72:72)),5))","v":""},{"$f":"IF(ISERROR(INDEX($A$1:$G$79,SMALL(IF($C$1:$C$79=$S$1,ROW($C$1:$C$79)),ROW(72:72)),7)),\"\",INDEX($A$1:$G$79,SMALL(IF($C$1:$C$79=$S$1,ROW($C$1:$C$79)),ROW(72:72)),7))","v":""},{"$f":"IF(ISERROR(INDEX($A$1:$H$79,SMALL(IF($C$1:$C$79=$S$1,ROW($C$1:$C$79)),ROW(72:72)),8)),\"\",INDEX($A$1:$H$79,SMALL(IF($C$1:$C$79=$S$1,ROW($C$1:$C$79)),ROW(72:72)),8))","v":""}," "]
[{"$f":"'Project Specific'!F26","v":"Please select answer"},{"$f":"'Project Specific'!G26","v":"Please select answer"},{"$f":"'Project Specific'!H26","v":"Please select answer"},{"$f":"'Project Specific'!B26","v":2},{"$f":"'Project Specific'!C26","v":"Services include relapse support"},{"$f":"'Project Specific'!D26","v":"Housing and services include relapse support that does not automatically evict or discharge a participant from the project for temporary relapse. Relapse support might  include referrals to outpatient treatment or direct provision of outpatient services or the ability to hold a unit for a certain period of time (30-90 days) while the participant undergoes residential treatment."},"Population",{"$f":"F75","v":"Optional notes here"},{"$f":"IF(ISERROR(INDEX($A$1:$G$79,SMALL(IF($A$1:$A$79=$I$1,ROW($A$1:$A$79)),ROW(73:73)),7)),\"\",INDEX($A$1:$G$79,SMALL(IF($A$1:$A$79=$I$1,ROW($A$1:$A$79)),ROW(73:73)),7))","v":""},{"$f":"IF(ISERROR(INDEX($A$1:$G$79,SMALL(IF($A$1:$A$79=$I$1,ROW($A$1:$A$79)),ROW(73:73)),4)),\"\",INDEX($A$1:$G$79,SMALL(IF($A$1:$A$79=$I$1,ROW($A$1:$A$79)),ROW(73:73)),4))","v":""},{"$f":"IF(ISERROR(INDEX($A$1:$G$79,SMALL(IF($A$1:$A$79=$I$1,ROW($A$1:$A$79)),ROW(73:73)),5)),\"\",INDEX($A$1:$G$79,SMALL(IF($A$1:$A$79=$I$1,ROW($A$1:$A$79)),ROW(73:73)),5))","v":""},{"$f":"IF(ISERROR(INDEX($A$1:$G$79,SMALL(IF($A$1:$A$79=$I$1,ROW($A$1:$A$79)),ROW(73:73)),6)),\"\",INDEX($A$1:$G$79,SMALL(IF($A$1:$A$79=$I$1,ROW($A$1:$A$79)),ROW(73:73)),6))","v":""},{"$f":"IF(ISERROR(INDEX($A$1:$H$79,SMALL(IF($A$1:$A$79=$I$1,ROW($A$1:$A$79)),ROW(73:73)),8)),\"\",INDEX($A$1:$H$79,SMALL(IF($A$1:$A$79=$I$1,ROW($A$1:$A$79)),ROW(73:73)),8))","v":""},{"$f":"IF(ISERROR(INDEX($A$1:$G$79,SMALL(IF($B$1:$B$79=$N$1,ROW($B$1:$B$79)),ROW(73:73)),6)),\"\",INDEX($A$1:$G$79,SMALL(IF($B$1:$B$79=$N$1,ROW($B$1:$B$79)),ROW(73:73)),6))","v":""},{"$f":"IF(ISERROR(INDEX($A$1:$G$79,SMALL(IF($B$1:$B$79=$N$1,ROW($B$1:$B$79)),ROW(73:73)),4)),\"\",INDEX($A$1:$G$79,SMALL(IF($B$1:$B$79=$N$1,ROW($B$1:$B$79)),ROW(73:73)),4))","v":""},{"$f":"IF(ISERROR(INDEX($A$1:$G$79,SMALL(IF($B$1:$B$79=$N$1,ROW($B$1:$B$79)),ROW(73:73)),5)),\"\",INDEX($A$1:$G$79,SMALL(IF($B$1:$B$79=$N$1,ROW($B$1:$B$79)),ROW(73:73)),5))","v":""},{"$f":"IF(ISERROR(INDEX($A$1:$G$79,SMALL(IF($B$1:$B$79=$N$1,ROW($B$1:$B$79)),ROW(73:73)),7)),\"\",INDEX($A$1:$G$79,SMALL(IF($B$1:$B$79=$N$1,ROW($B$1:$B$79)),ROW(73:73)),7))","v":""},{"$f":"IF(ISERROR(INDEX($A$1:$H$79,SMALL(IF($B$1:$B$79=$N$1,ROW($B$1:$B$79)),ROW(73:73)),8)),\"\",INDEX($A$1:$H$79,SMALL(IF($B$1:$B$79=$N$1,ROW($B$1:$B$79)),ROW(73:73)),8))","v":""},{"$f":"IF(ISERROR(INDEX($A$1:$G$79,SMALL(IF($C$1:$C$79=$S$1,ROW($C$1:$C$79)),ROW(73:73)),6)),\"\",INDEX($A$1:$G$79,SMALL(IF($C$1:$C$79=$S$1,ROW($C$1:$C$79)),ROW(73:73)),6))","v":""},{"$f":"IF(ISERROR(INDEX($A$1:$G$79,SMALL(IF($C$1:$C$79=$S$1,ROW($C$1:$C$79)),ROW(73:73)),4)),\"\",INDEX($A$1:$G$79,SMALL(IF($C$1:$C$79=$S$1,ROW($C$1:$C$79)),ROW(73:73)),4))","v":""},{"$f":"IF(ISERROR(INDEX($A$1:$G$79,SMALL(IF($C$1:$C$79=$S$1,ROW($C$1:$C$79)),ROW(73:73)),5)),\"\",INDEX($A$1:$G$79,SMALL(IF($C$1:$C$79=$S$1,ROW($C$1:$C$79)),ROW(73:73)),5))","v":""},{"$f":"IF(ISERROR(INDEX($A$1:$G$79,SMALL(IF($C$1:$C$79=$S$1,ROW($C$1:$C$79)),ROW(73:73)),7)),\"\",INDEX($A$1:$G$79,SMALL(IF($C$1:$C$79=$S$1,ROW($C$1:$C$79)),ROW(73:73)),7))","v":""},{"$f":"IF(ISERROR(INDEX($A$1:$H$79,SMALL(IF($C$1:$C$79=$S$1,ROW($C$1:$C$79)),ROW(73:73)),8)),\"\",INDEX($A$1:$H$79,SMALL(IF($C$1:$C$79=$S$1,ROW($C$1:$C$79)),ROW(73:73)),8))","v":""}," "]
[{"$f":"'Project Specific'!F27","v":0},{"$f":"'Project Specific'!G27","v":0},{"$f":"'Project Specific'!H27","v":0},{"$f":"'Project Specific'!B27","v":0},{"$f":"'Project Specific'!C27","v":0},{"$f":"'Project Specific'!D27","v":"Optional notes here"},"Population",0,{"$f":"IF(ISERROR(INDEX($A$1:$G$79,SMALL(IF($A$1:$A$79=$I$1,ROW($A$1:$A$79)),ROW(74:74)),7)),\"\",INDEX($A$1:$G$79,SMALL(IF($A$1:$A$79=$I$1,ROW($A$1:$A$79)),ROW(74:74)),7))","v":""},{"$f":"IF(ISERROR(INDEX($A$1:$G$79,SMALL(IF($A$1:$A$79=$I$1,ROW($A$1:$A$79)),ROW(74:74)),4)),\"\",INDEX($A$1:$G$79,SMALL(IF($A$1:$A$79=$I$1,ROW($A$1:$A$79)),ROW(74:74)),4))","v":""},{"$f":"IF(ISERROR(INDEX($A$1:$G$79,SMALL(IF($A$1:$A$79=$I$1,ROW($A$1:$A$79)),ROW(74:74)),5)),\"\",INDEX($A$1:$G$79,SMALL(IF($A$1:$A$79=$I$1,ROW($A$1:$A$79)),ROW(74:74)),5))","v":""},{"$f":"IF(ISERROR(INDEX($A$1:$G$79,SMALL(IF($A$1:$A$79=$I$1,ROW($A$1:$A$79)),ROW(74:74)),6)),\"\",INDEX($A$1:$G$79,SMALL(IF($A$1:$A$79=$I$1,ROW($A$1:$A$79)),ROW(74:74)),6))","v":""},{"$f":"IF(ISERROR(INDEX($A$1:$H$79,SMALL(IF($A$1:$A$79=$I$1,ROW($A$1:$A$79)),ROW(74:74)),8)),\"\",INDEX($A$1:$H$79,SMALL(IF($A$1:$A$79=$I$1,ROW($A$1:$A$79)),ROW(74:74)),8))","v":""},{"$f":"IF(ISERROR(INDEX($A$1:$G$79,SMALL(IF($B$1:$B$79=$N$1,ROW($B$1:$B$79)),ROW(74:74)),6)),\"\",INDEX($A$1:$G$79,SMALL(IF($B$1:$B$79=$N$1,ROW($B$1:$B$79)),ROW(74:74)),6))","v":""},{"$f":"IF(ISERROR(INDEX($A$1:$G$79,SMALL(IF($B$1:$B$79=$N$1,ROW($B$1:$B$79)),ROW(74:74)),4)),\"\",INDEX($A$1:$G$79,SMALL(IF($B$1:$B$79=$N$1,ROW($B$1:$B$79)),ROW(74:74)),4))","v":""},{"$f":"IF(ISERROR(INDEX($A$1:$G$79,SMALL(IF($B$1:$B$79=$N$1,ROW($B$1:$B$79)),ROW(74:74)),5)),\"\",INDEX($A$1:$G$79,SMALL(IF($B$1:$B$79=$N$1,ROW($B$1:$B$79)),ROW(74:74)),5))","v":""},{"$f":"IF(ISERROR(INDEX($A$1:$G$79,SMALL(IF($B$1:$B$79=$N$1,ROW($B$1:$B$79)),ROW(74:74)),7)),\"\",INDEX($A$1:$G$79,SMALL(IF($B$1:$B$79=$N$1,ROW($B$1:$B$79)),ROW(74:74)),7))","v":""},{"$f":"IF(ISERROR(INDEX($A$1:$H$79,SMALL(IF($B$1:$B$79=$N$1,ROW($B$1:$B$79)),ROW(74:74)),8)),\"\",INDEX($A$1:$H$79,SMALL(IF($B$1:$B$79=$N$1,ROW($B$1:$B$79)),ROW(74:74)),8))","v":""},{"$f":"IF(ISERROR(INDEX($A$1:$G$79,SMALL(IF($C$1:$C$79=$S$1,ROW($C$1:$C$79)),ROW(74:74)),6)),\"\",INDEX($A$1:$G$79,SMALL(IF($C$1:$C$79=$S$1,ROW($C$1:$C$79)),ROW(74:74)),6))","v":""},{"$f":"IF(ISERROR(INDEX($A$1:$G$79,SMALL(IF($C$1:$C$79=$S$1,ROW($C$1:$C$79)),ROW(74:74)),4)),\"\",INDEX($A$1:$G$79,SMALL(IF($C$1:$C$79=$S$1,ROW($C$1:$C$79)),ROW(74:74)),4))","v":""},{"$f":"IF(ISERROR(INDEX($A$1:$G$79,SMALL(IF($C$1:$C$79=$S$1,ROW($C$1:$C$79)),ROW(74:74)),5)),\"\",INDEX($A$1:$G$79,SMALL(IF($C$1:$C$79=$S$1,ROW($C$1:$C$79)),ROW(74:74)),5))","v":""},{"$f":"IF(ISERROR(INDEX($A$1:$G$79,SMALL(IF($C$1:$C$79=$S$1,ROW($C$1:$C$79)),ROW(74:74)),7)),\"\",INDEX($A$1:$G$79,SMALL(IF($C$1:$C$79=$S$1,ROW($C$1:$C$79)),ROW(74:74)),7))","v":""},{"$f":"IF(ISERROR(INDEX($A$1:$H$79,SMALL(IF($C$1:$C$79=$S$1,ROW($C$1:$C$79)),ROW(74:74)),8)),\"\",INDEX($A$1:$H$79,SMALL(IF($C$1:$C$79=$S$1,ROW($C$1:$C$79)),ROW(74:74)),8))","v":""}," "]
[{"$f":"'Project Specific'!F28","v":"Please select answer"},{"$f":"'Project Specific'!G28","v":"Please select answer"},{"$f":"'Project Specific'!H28","v":"Please select answer"},{"$f":"'Project Specific'!B28","v":3},{"$f":"'Project Specific'!C28","v":"Services support sustained recovery"},{"$f":"'Project Specific'!D28","v":"Recovery housing projects provide services that align with participants’ choice and prioritization of recovery, including but not limited to abstinence from substances (if that is a personal goal), long-term permanent housing stability, and stable income through employment or benefits. Support is offered through connections to community-based treatment options."},"Population",{"$f":"F77","v":"Optional notes here"},{"$f":"IF(ISERROR(INDEX($A$1:$G$79,SMALL(IF($A$1:$A$79=$I$1,ROW($A$1:$A$79)),ROW(75:75)),7)),\"\",INDEX($A$1:$G$79,SMALL(IF($A$1:$A$79=$I$1,ROW($A$1:$A$79)),ROW(75:75)),7))","v":""},{"$f":"IF(ISERROR(INDEX($A$1:$G$79,SMALL(IF($A$1:$A$79=$I$1,ROW($A$1:$A$79)),ROW(75:75)),4)),\"\",INDEX($A$1:$G$79,SMALL(IF($A$1:$A$79=$I$1,ROW($A$1:$A$79)),ROW(75:75)),4))","v":""},{"$f":"IF(ISERROR(INDEX($A$1:$G$79,SMALL(IF($A$1:$A$79=$I$1,ROW($A$1:$A$79)),ROW(75:75)),5)),\"\",INDEX($A$1:$G$79,SMALL(IF($A$1:$A$79=$I$1,ROW($A$1:$A$79)),ROW(75:75)),5))","v":""},{"$f":"IF(ISERROR(INDEX($A$1:$G$79,SMALL(IF($A$1:$A$79=$I$1,ROW($A$1:$A$79)),ROW(75:75)),6)),\"\",INDEX($A$1:$G$79,SMALL(IF($A$1:$A$79=$I$1,ROW($A$1:$A$79)),ROW(75:75)),6))","v":""},{"$f":"IF(ISERROR(INDEX($A$1:$H$79,SMALL(IF($A$1:$A$79=$I$1,ROW($A$1:$A$79)),ROW(75:75)),8)),\"\",INDEX($A$1:$H$79,SMALL(IF($A$1:$A$79=$I$1,ROW($A$1:$A$79)),ROW(75:75)),8))","v":""},{"$f":"IF(ISERROR(INDEX($A$1:$G$79,SMALL(IF($B$1:$B$79=$N$1,ROW($B$1:$B$79)),ROW(75:75)),6)),\"\",INDEX($A$1:$G$79,SMALL(IF($B$1:$B$79=$N$1,ROW($B$1:$B$79)),ROW(75:75)),6))","v":""},{"$f":"IF(ISERROR(INDEX($A$1:$G$79,SMALL(IF($B$1:$B$79=$N$1,ROW($B$1:$B$79)),ROW(75:75)),4)),\"\",INDEX($A$1:$G$79,SMALL(IF($B$1:$B$79=$N$1,ROW($B$1:$B$79)),ROW(75:75)),4))","v":""},{"$f":"IF(ISERROR(INDEX($A$1:$G$79,SMALL(IF($B$1:$B$79=$N$1,ROW($B$1:$B$79)),ROW(75:75)),5)),\"\",INDEX($A$1:$G$79,SMALL(IF($B$1:$B$79=$N$1,ROW($B$1:$B$79)),ROW(75:75)),5))","v":""},{"$f":"IF(ISERROR(INDEX($A$1:$G$79,SMALL(IF($B$1:$B$79=$N$1,ROW($B$1:$B$79)),ROW(75:75)),7)),\"\",INDEX($A$1:$G$79,SMALL(IF($B$1:$B$79=$N$1,ROW($B$1:$B$79)),ROW(75:75)),7))","v":""},{"$f":"IF(ISERROR(INDEX($A$1:$H$79,SMALL(IF($B$1:$B$79=$N$1,ROW($B$1:$B$79)),ROW(75:75)),8)),\"\",INDEX($A$1:$H$79,SMALL(IF($B$1:$B$79=$N$1,ROW($B$1:$B$79)),ROW(75:75)),8))","v":""},{"$f":"IF(ISERROR(INDEX($A$1:$G$79,SMALL(IF($C$1:$C$79=$S$1,ROW($C$1:$C$79)),ROW(75:75)),6)),\"\",INDEX($A$1:$G$79,SMALL(IF($C$1:$C$79=$S$1,ROW($C$1:$C$79)),ROW(75:75)),6))","v":""},{"$f":"IF(ISERROR(INDEX($A$1:$G$79,SMALL(IF($C$1:$C$79=$S$1,ROW($C$1:$C$79)),ROW(75:75)),4)),\"\",INDEX($A$1:$G$79,SMALL(IF($C$1:$C$79=$S$1,ROW($C$1:$C$79)),ROW(75:75)),4))","v":""},{"$f":"IF(ISERROR(INDEX($A$1:$G$79,SMALL(IF($C$1:$C$79=$S$1,ROW($C$1:$C$79)),ROW(75:75)),5)),\"\",INDEX($A$1:$G$79,SMALL(IF($C$1:$C$79=$S$1,ROW($C$1:$C$79)),ROW(75:75)),5))","v":""},{"$f":"IF(ISERROR(INDEX($A$1:$G$79,SMALL(IF($C$1:$C$79=$S$1,ROW($C$1:$C$79)),ROW(75:75)),7)),\"\",INDEX($A$1:$G$79,SMALL(IF($C$1:$C$79=$S$1,ROW($C$1:$C$79)),ROW(75:75)),7))","v":""},{"$f":"IF(ISERROR(INDEX($A$1:$H$79,SMALL(IF($C$1:$C$79=$S$1,ROW($C$1:$C$79)),ROW(75:75)),8)),\"\",INDEX($A$1:$H$79,SMALL(IF($C$1:$C$79=$S$1,ROW($C$1:$C$79)),ROW(75:75)),8))","v":""}," "]
[{"$f":"'Project Specific'!F29","v":0},{"$f":"'Project Specific'!G29","v":0},{"$f":"'Project Specific'!H29","v":0},{"$f":"'Project Specific'!B29","v":0},{"$f":"'Project Specific'!C29","v":0},{"$f":"'Project Specific'!D29","v":"Optional notes here"},"Population",0,{"$f":"IF(ISERROR(INDEX($A$1:$G$79,SMALL(IF($A$1:$A$79=$I$1,ROW($A$1:$A$79)),ROW(76:76)),7)),\"\",INDEX($A$1:$G$79,SMALL(IF($A$1:$A$79=$I$1,ROW($A$1:$A$79)),ROW(76:76)),7))","v":""},{"$f":"IF(ISERROR(INDEX($A$1:$G$79,SMALL(IF($A$1:$A$79=$I$1,ROW($A$1:$A$79)),ROW(76:76)),4)),\"\",INDEX($A$1:$G$79,SMALL(IF($A$1:$A$79=$I$1,ROW($A$1:$A$79)),ROW(76:76)),4))","v":""},{"$f":"IF(ISERROR(INDEX($A$1:$G$79,SMALL(IF($A$1:$A$79=$I$1,ROW($A$1:$A$79)),ROW(76:76)),5)),\"\",INDEX($A$1:$G$79,SMALL(IF($A$1:$A$79=$I$1,ROW($A$1:$A$79)),ROW(76:76)),5))","v":""},{"$f":"IF(ISERROR(INDEX($A$1:$G$79,SMALL(IF($A$1:$A$79=$I$1,ROW($A$1:$A$79)),ROW(76:76)),6)),\"\",INDEX($A$1:$G$79,SMALL(IF($A$1:$A$79=$I$1,ROW($A$1:$A$79)),ROW(76:76)),6))","v":""},{"$f":"IF(ISERROR(INDEX($A$1:$H$79,SMALL(IF($A$1:$A$79=$I$1,ROW($A$1:$A$79)),ROW(76:76)),8)),\"\",INDEX($A$1:$H$79,SMALL(IF($A$1:$A$79=$I$1,ROW($A$1:$A$79)),ROW(76:76)),8))","v":""},{"$f":"IF(ISERROR(INDEX($A$1:$G$79,SMALL(IF($B$1:$B$79=$N$1,ROW($B$1:$B$79)),ROW(76:76)),6)),\"\",INDEX($A$1:$G$79,SMALL(IF($B$1:$B$79=$N$1,ROW($B$1:$B$79)),ROW(76:76)),6))","v":""},{"$f":"IF(ISERROR(INDEX($A$1:$G$79,SMALL(IF($B$1:$B$79=$N$1,ROW($B$1:$B$79)),ROW(76:76)),4)),\"\",INDEX($A$1:$G$79,SMALL(IF($B$1:$B$79=$N$1,ROW($B$1:$B$79)),ROW(76:76)),4))","v":""},{"$f":"IF(ISERROR(INDEX($A$1:$G$79,SMALL(IF($B$1:$B$79=$N$1,ROW($B$1:$B$79)),ROW(76:76)),5)),\"\",INDEX($A$1:$G$79,SMALL(IF($B$1:$B$79=$N$1,ROW($B$1:$B$79)),ROW(76:76)),5))","v":""},{"$f":"IF(ISERROR(INDEX($A$1:$G$79,SMALL(IF($B$1:$B$79=$N$1,ROW($B$1:$B$79)),ROW(76:76)),7)),\"\",INDEX($A$1:$G$79,SMALL(IF($B$1:$B$79=$N$1,ROW($B$1:$B$79)),ROW(76:76)),7))","v":""},{"$f":"IF(ISERROR(INDEX($A$1:$H$79,SMALL(IF($B$1:$B$79=$N$1,ROW($B$1:$B$79)),ROW(76:76)),8)),\"\",INDEX($A$1:$H$79,SMALL(IF($B$1:$B$79=$N$1,ROW($B$1:$B$79)),ROW(76:76)),8))","v":""},{"$f":"IF(ISERROR(INDEX($A$1:$G$79,SMALL(IF($C$1:$C$79=$S$1,ROW($C$1:$C$79)),ROW(76:76)),6)),\"\",INDEX($A$1:$G$79,SMALL(IF($C$1:$C$79=$S$1,ROW($C$1:$C$79)),ROW(76:76)),6))","v":""},{"$f":"IF(ISERROR(INDEX($A$1:$G$79,SMALL(IF($C$1:$C$79=$S$1,ROW($C$1:$C$79)),ROW(76:76)),4)),\"\",INDEX($A$1:$G$79,SMALL(IF($C$1:$C$79=$S$1,ROW($C$1:$C$79)),ROW(76:76)),4))","v":""},{"$f":"IF(ISERROR(INDEX($A$1:$G$79,SMALL(IF($C$1:$C$79=$S$1,ROW($C$1:$C$79)),ROW(76:76)),5)),\"\",INDEX($A$1:$G$79,SMALL(IF($C$1:$C$79=$S$1,ROW($C$1:$C$79)),ROW(76:76)),5))","v":""},{"$f":"IF(ISERROR(INDEX($A$1:$G$79,SMALL(IF($C$1:$C$79=$S$1,ROW($C$1:$C$79)),ROW(76:76)),7)),\"\",INDEX($A$1:$G$79,SMALL(IF($C$1:$C$79=$S$1,ROW($C$1:$C$79)),ROW(76:76)),7))","v":""},{"$f":"IF(ISERROR(INDEX($A$1:$H$79,SMALL(IF($C$1:$C$79=$S$1,ROW($C$1:$C$79)),ROW(76:76)),8)),\"\",INDEX($A$1:$H$79,SMALL(IF($C$1:$C$79=$S$1,ROW($C$1:$C$79)),ROW(76:76)),8))","v":""}," "]
[{"$f":"'Project Specific'!F30","v":"Please select answer"},{"$f":"'Project Specific'!G30","v":"Please select answer"},{"$f":"'Project Specific'!H30","v":"Please select answer"},{"$f":"'Project Specific'!B30","v":4},{"$f":"'Project Specific'!C30","v":0},{"$f":"'Project Specific'!D30","v":"No additional standards"},"Population",{"$f":"F79","v":"Optional notes here"},{"$f":"IF(ISERROR(INDEX($A$1:$G$79,SMALL(IF($A$1:$A$79=$I$1,ROW($A$1:$A$79)),ROW(77:77)),7)),\"\",INDEX($A$1:$G$79,SMALL(IF($A$1:$A$79=$I$1,ROW($A$1:$A$79)),ROW(77:77)),7))","v":""},{"$f":"IF(ISERROR(INDEX($A$1:$G$79,SMALL(IF($A$1:$A$79=$I$1,ROW($A$1:$A$79)),ROW(77:77)),4)),\"\",INDEX($A$1:$G$79,SMALL(IF($A$1:$A$79=$I$1,ROW($A$1:$A$79)),ROW(77:77)),4))","v":""},{"$f":"IF(ISERROR(INDEX($A$1:$G$79,SMALL(IF($A$1:$A$79=$I$1,ROW($A$1:$A$79)),ROW(77:77)),5)),\"\",INDEX($A$1:$G$79,SMALL(IF($A$1:$A$79=$I$1,ROW($A$1:$A$79)),ROW(77:77)),5))","v":""},{"$f":"IF(ISERROR(INDEX($A$1:$G$79,SMALL(IF($A$1:$A$79=$I$1,ROW($A$1:$A$79)),ROW(77:77)),6)),\"\",INDEX($A$1:$G$79,SMALL(IF($A$1:$A$79=$I$1,ROW($A$1:$A$79)),ROW(77:77)),6))","v":""},{"$f":"IF(ISERROR(INDEX($A$1:$H$79,SMALL(IF($A$1:$A$79=$I$1,ROW($A$1:$A$79)),ROW(77:77)),8)),\"\",INDEX($A$1:$H$79,SMALL(IF($A$1:$A$79=$I$1,ROW($A$1:$A$79)),ROW(77:77)),8))","v":""},{"$f":"IF(ISERROR(INDEX($A$1:$G$79,SMALL(IF($B$1:$B$79=$N$1,ROW($B$1:$B$79)),ROW(77:77)),6)),\"\",INDEX($A$1:$G$79,SMALL(IF($B$1:$B$79=$N$1,ROW($B$1:$B$79)),ROW(77:77)),6))","v":""},{"$f":"IF(ISERROR(INDEX($A$1:$G$79,SMALL(IF($B$1:$B$79=$N$1,ROW($B$1:$B$79)),ROW(77:77)),4)),\"\",INDEX($A$1:$G$79,SMALL(IF($B$1:$B$79=$N$1,ROW($B$1:$B$79)),ROW(77:77)),4))","v":""},{"$f":"IF(ISERROR(INDEX($A$1:$G$79,SMALL(IF($B$1:$B$79=$N$1,ROW($B$1:$B$79)),ROW(77:77)),5)),\"\",INDEX($A$1:$G$79,SMALL(IF($B$1:$B$79=$N$1,ROW($B$1:$B$79)),ROW(77:77)),5))","v":""},{"$f":"IF(ISERROR(INDEX($A$1:$G$79,SMALL(IF($B$1:$B$79=$N$1,ROW($B$1:$B$79)),ROW(77:77)),7)),\"\",INDEX($A$1:$G$79,SMALL(IF($B$1:$B$79=$N$1,ROW($B$1:$B$79)),ROW(77:77)),7))","v":""},{"$f":"IF(ISERROR(INDEX($A$1:$H$79,SMALL(IF($B$1:$B$79=$N$1,ROW($B$1:$B$79)),ROW(77:77)),8)),\"\",INDEX($A$1:$H$79,SMALL(IF($B$1:$B$79=$N$1,ROW($B$1:$B$79)),ROW(77:77)),8))","v":""},{"$f":"IF(ISERROR(INDEX($A$1:$G$79,SMALL(IF($C$1:$C$79=$S$1,ROW($C$1:$C$79)),ROW(77:77)),6)),\"\",INDEX($A$1:$G$79,SMALL(IF($C$1:$C$79=$S$1,ROW($C$1:$C$79)),ROW(77:77)),6))","v":""},{"$f":"IF(ISERROR(INDEX($A$1:$G$79,SMALL(IF($C$1:$C$79=$S$1,ROW($C$1:$C$79)),ROW(77:77)),4)),\"\",INDEX($A$1:$G$79,SMALL(IF($C$1:$C$79=$S$1,ROW($C$1:$C$79)),ROW(77:77)),4))","v":""},{"$f":"IF(ISERROR(INDEX($A$1:$G$79,SMALL(IF($C$1:$C$79=$S$1,ROW($C$1:$C$79)),ROW(77:77)),5)),\"\",INDEX($A$1:$G$79,SMALL(IF($C$1:$C$79=$S$1,ROW($C$1:$C$79)),ROW(77:77)),5))","v":""},{"$f":"IF(ISERROR(INDEX($A$1:$G$79,SMALL(IF($C$1:$C$79=$S$1,ROW($C$1:$C$79)),ROW(77:77)),7)),\"\",INDEX($A$1:$G$79,SMALL(IF($C$1:$C$79=$S$1,ROW($C$1:$C$79)),ROW(77:77)),7))","v":""},{"$f":"IF(ISERROR(INDEX($A$1:$H$79,SMALL(IF($C$1:$C$79=$S$1,ROW($C$1:$C$79)),ROW(77:77)),8)),\"\",INDEX($A$1:$H$79,SMALL(IF($C$1:$C$79=$S$1,ROW($C$1:$C$79)),ROW(77:77)),8))","v":""}," "]
[{"$f":"'Project Specific'!F31","v":0},{"$f":"'Project Specific'!G31","v":0},{"$f":"'Project Specific'!H31","v":0},{"$f":"'Project Specific'!B31","v":0},{"$f":"'Project Specific'!C31","v":0},{"$f":"'Project Specific'!D31","v":"Optional notes here"},"Population",0,{"$f":"IF(ISERROR(INDEX($A$1:$G$79,SMALL(IF($A$1:$A$79=$I$1,ROW($A$1:$A$79)),ROW(78:78)),7)),\"\",INDEX($A$1:$G$79,SMALL(IF($A$1:$A$79=$I$1,ROW($A$1:$A$79)),ROW(78:78)),7))","v":""},{"$f":"IF(ISERROR(INDEX($A$1:$G$79,SMALL(IF($A$1:$A$79=$I$1,ROW($A$1:$A$79)),ROW(78:78)),4)),\"\",INDEX($A$1:$G$79,SMALL(IF($A$1:$A$79=$I$1,ROW($A$1:$A$79)),ROW(78:78)),4))","v":""},{"$f":"IF(ISERROR(INDEX($A$1:$G$79,SMALL(IF($A$1:$A$79=$I$1,ROW($A$1:$A$79)),ROW(78:78)),5)),\"\",INDEX($A$1:$G$79,SMALL(IF($A$1:$A$79=$I$1,ROW($A$1:$A$79)),ROW(78:78)),5))","v":""},{"$f":"IF(ISERROR(INDEX($A$1:$G$79,SMALL(IF($A$1:$A$79=$I$1,ROW($A$1:$A$79)),ROW(78:78)),6)),\"\",INDEX($A$1:$G$79,SMALL(IF($A$1:$A$79=$I$1,ROW($A$1:$A$79)),ROW(78:78)),6))","v":""},{"$f":"IF(ISERROR(INDEX($A$1:$H$79,SMALL(IF($A$1:$A$79=$I$1,ROW($A$1:$A$79)),ROW(78:78)),8)),\"\",INDEX($A$1:$H$79,SMALL(IF($A$1:$A$79=$I$1,ROW($A$1:$A$79)),ROW(78:78)),8))","v":""},{"$f":"IF(ISERROR(INDEX($A$1:$G$79,SMALL(IF($B$1:$B$79=$N$1,ROW($B$1:$B$79)),ROW(78:78)),6)),\"\",INDEX($A$1:$G$79,SMALL(IF($B$1:$B$79=$N$1,ROW($B$1:$B$79)),ROW(78:78)),6))","v":""},{"$f":"IF(ISERROR(INDEX($A$1:$G$79,SMALL(IF($B$1:$B$79=$N$1,ROW($B$1:$B$79)),ROW(78:78)),4)),\"\",INDEX($A$1:$G$79,SMALL(IF($B$1:$B$79=$N$1,ROW($B$1:$B$79)),ROW(78:78)),4))","v":""},{"$f":"IF(ISERROR(INDEX($A$1:$G$79,SMALL(IF($B$1:$B$79=$N$1,ROW($B$1:$B$79)),ROW(78:78)),5)),\"\",INDEX($A$1:$G$79,SMALL(IF($B$1:$B$79=$N$1,ROW($B$1:$B$79)),ROW(78:78)),5))","v":""},{"$f":"IF(ISERROR(INDEX($A$1:$G$79,SMALL(IF($B$1:$B$79=$N$1,ROW($B$1:$B$79)),ROW(78:78)),7)),\"\",INDEX($A$1:$G$79,SMALL(IF($B$1:$B$79=$N$1,ROW($B$1:$B$79)),ROW(78:78)),7))","v":""},{"$f":"IF(ISERROR(INDEX($A$1:$H$79,SMALL(IF($B$1:$B$79=$N$1,ROW($B$1:$B$79)),ROW(78:78)),8)),\"\",INDEX($A$1:$H$79,SMALL(IF($B$1:$B$79=$N$1,ROW($B$1:$B$79)),ROW(78:78)),8))","v":""},{"$f":"IF(ISERROR(INDEX($A$1:$G$79,SMALL(IF($C$1:$C$79=$S$1,ROW($C$1:$C$79)),ROW(78:78)),6)),\"\",INDEX($A$1:$G$79,SMALL(IF($C$1:$C$79=$S$1,ROW($C$1:$C$79)),ROW(78:78)),6))","v":""},{"$f":"IF(ISERROR(INDEX($A$1:$G$79,SMALL(IF($C$1:$C$79=$S$1,ROW($C$1:$C$79)),ROW(78:78)),4)),\"\",INDEX($A$1:$G$79,SMALL(IF($C$1:$C$79=$S$1,ROW($C$1:$C$79)),ROW(78:78)),4))","v":""},{"$f":"IF(ISERROR(INDEX($A$1:$G$79,SMALL(IF($C$1:$C$79=$S$1,ROW($C$1:$C$79)),ROW(78:78)),5)),\"\",INDEX($A$1:$G$79,SMALL(IF($C$1:$C$79=$S$1,ROW($C$1:$C$79)),ROW(78:78)),5))","v":""},{"$f":"IF(ISERROR(INDEX($A$1:$G$79,SMALL(IF($C$1:$C$79=$S$1,ROW($C$1:$C$79)),ROW(78:78)),7)),\"\",INDEX($A$1:$G$79,SMALL(IF($C$1:$C$79=$S$1,ROW($C$1:$C$79)),ROW(78:78)),7))","v":""},{"$f":"IF(ISERROR(INDEX($A$1:$H$79,SMALL(IF($C$1:$C$79=$S$1,ROW($C$1:$C$79)),ROW(78:78)),8)),\"\",INDEX($A$1:$H$79,SMALL(IF($C$1:$C$79=$S$1,ROW($C$1:$C$79)),ROW(78:78)),8))","v":""}," "]
[null,null,null,null,null,null,null,null,{"$f":"IF(ISERROR(INDEX($A$1:$G$79,SMALL(IF($A$1:$A$79=$I$1,ROW($A$1:$A$79)),ROW(79:79)),7)),\"\",INDEX($A$1:$G$79,SMALL(IF($A$1:$A$79=$I$1,ROW($A$1:$A$79)),ROW(79:79)),7))","v":""},{"$f":"IF(ISERROR(INDEX($A$1:$G$79,SMALL(IF($A$1:$A$79=$I$1,ROW($A$1:$A$79)),ROW(79:79)),4)),\"\",INDEX($A$1:$G$79,SMALL(IF($A$1:$A$79=$I$1,ROW($A$1:$A$79)),ROW(79:79)),4))","v":""},{"$f":"IF(ISERROR(INDEX($A$1:$G$79,SMALL(IF($A$1:$A$79=$I$1,ROW($A$1:$A$79)),ROW(79:79)),5)),\"\",INDEX($A$1:$G$79,SMALL(IF($A$1:$A$79=$I$1,ROW($A$1:$A$79)),ROW(79:79)),5))","v":""},{"$f":"IF(ISERROR(INDEX($A$1:$G$79,SMALL(IF($A$1:$A$79=$I$1,ROW($A$1:$A$79)),ROW(79:79)),6)),\"\",INDEX($A$1:$G$79,SMALL(IF($A$1:$A$79=$I$1,ROW($A$1:$A$79)),ROW(79:79)),6))","v":""},{"$f":"IF(ISERROR(INDEX($A$1:$H$79,SMALL(IF($A$1:$A$79=$I$1,ROW($A$1:$A$79)),ROW(79:79)),8)),\"\",INDEX($A$1:$H$79,SMALL(IF($A$1:$A$79=$I$1,ROW($A$1:$A$79)),ROW(79:79)),8))","v":""},{"$f":"IF(ISERROR(INDEX($A$1:$G$79,SMALL(IF($B$1:$B$79=$N$1,ROW($B$1:$B$79)),ROW(79:79)),6)),\"\",INDEX($A$1:$G$79,SMALL(IF($B$1:$B$79=$N$1,ROW($B$1:$B$79)),ROW(79:79)),6))","v":""},{"$f":"IF(ISERROR(INDEX($A$1:$G$79,SMALL(IF($B$1:$B$79=$N$1,ROW($B$1:$B$79)),ROW(79:79)),4)),\"\",INDEX($A$1:$G$79,SMALL(IF($B$1:$B$79=$N$1,ROW($B$1:$B$79)),ROW(79:79)),4))","v":""},{"$f":"IF(ISERROR(INDEX($A$1:$G$79,SMALL(IF($B$1:$B$79=$N$1,ROW($B$1:$B$79)),ROW(79:79)),5)),\"\",INDEX($A$1:$G$79,SMALL(IF($B$1:$B$79=$N$1,ROW($B$1:$B$79)),ROW(79:79)),5))","v":""},{"$f":"IF(ISERROR(INDEX($A$1:$G$79,SMALL(IF($B$1:$B$79=$N$1,ROW($B$1:$B$79)),ROW(79:79)),7)),\"\",INDEX($A$1:$G$79,SMALL(IF($B$1:$B$79=$N$1,ROW($B$1:$B$79)),ROW(79:79)),7))","v":""},{"$f":"IF(ISERROR(INDEX($A$1:$H$79,SMALL(IF($B$1:$B$79=$N$1,ROW($B$1:$B$79)),ROW(79:79)),8)),\"\",INDEX($A$1:$H$79,SMALL(IF($B$1:$B$79=$N$1,ROW($B$1:$B$79)),ROW(79:79)),8))","v":""},{"$f":"IF(ISERROR(INDEX($A$1:$G$79,SMALL(IF($C$1:$C$79=$S$1,ROW($C$1:$C$79)),ROW(79:79)),6)),\"\",INDEX($A$1:$G$79,SMALL(IF($C$1:$C$79=$S$1,ROW($C$1:$C$79)),ROW(79:79)),6))","v":""},{"$f":"IF(ISERROR(INDEX($A$1:$G$79,SMALL(IF($C$1:$C$79=$S$1,ROW($C$1:$C$79)),ROW(79:79)),4)),\"\",INDEX($A$1:$G$79,SMALL(IF($C$1:$C$79=$S$1,ROW($C$1:$C$79)),ROW(79:79)),4))","v":""},{"$f":"IF(ISERROR(INDEX($A$1:$G$79,SMALL(IF($C$1:$C$79=$S$1,ROW($C$1:$C$79)),ROW(79:79)),5)),\"\",INDEX($A$1:$G$79,SMALL(IF($C$1:$C$79=$S$1,ROW($C$1:$C$79)),ROW(79:79)),5))","v":""},{"$f":"IF(ISERROR(INDEX($A$1:$G$79,SMALL(IF($C$1:$C$79=$S$1,ROW($C$1:$C$79)),ROW(79:79)),7)),\"\",INDEX($A$1:$G$79,SMALL(IF($C$1:$C$79=$S$1,ROW($C$1:$C$79)),ROW(79:79)),7))","v":""},{"$f":"IF(ISERROR(INDEX($A$1:$H$79,SMALL(IF($C$1:$C$79=$S$1,ROW($C$1:$C$79)),ROW(79:79)),8)),\"\",INDEX($A$1:$H$79,SMALL(IF($C$1:$C$79=$S$1,ROW($C$1:$C$79)),ROW(79:79)),8))","v":""}," "]
[null,null,null,null,null,null,null,null,{"$f":"IF(ISERROR(INDEX($A$1:$G$79,SMALL(IF($A$1:$A$79=$I$1,ROW($A$1:$A$79)),ROW(80:80)),7)),\"\",INDEX($A$1:$G$79,SMALL(IF($A$1:$A$79=$I$1,ROW($A$1:$A$79)),ROW(80:80)),7))","v":""},{"$f":"IF(ISERROR(INDEX($A$1:$G$79,SMALL(IF($A$1:$A$79=$I$1,ROW($A$1:$A$79)),ROW(80:80)),4)),\"\",INDEX($A$1:$G$79,SMALL(IF($A$1:$A$79=$I$1,ROW($A$1:$A$79)),ROW(80:80)),4))","v":""},{"$f":"IF(ISERROR(INDEX($A$1:$G$79,SMALL(IF($A$1:$A$79=$I$1,ROW($A$1:$A$79)),ROW(80:80)),5)),\"\",INDEX($A$1:$G$79,SMALL(IF($A$1:$A$79=$I$1,ROW($A$1:$A$79)),ROW(80:80)),5))","v":""},{"$f":"IF(ISERROR(INDEX($A$1:$G$79,SMALL(IF($A$1:$A$79=$I$1,ROW($A$1:$A$79)),ROW(80:80)),6)),\"\",INDEX($A$1:$G$79,SMALL(IF($A$1:$A$79=$I$1,ROW($A$1:$A$79)),ROW(80:80)),6))","v":""},{"$f":"IF(ISERROR(INDEX($A$1:$H$79,SMALL(IF($A$1:$A$79=$I$1,ROW($A$1:$A$79)),ROW(80:80)),8)),\"\",INDEX($A$1:$H$79,SMALL(IF($A$1:$A$79=$I$1,ROW($A$1:$A$79)),ROW(80:80)),8))","v":""},{"$f":"IF(ISERROR(INDEX($A$1:$G$79,SMALL(IF($B$1:$B$79=$N$1,ROW($B$1:$B$79)),ROW(80:80)),6)),\"\",INDEX($A$1:$G$79,SMALL(IF($B$1:$B$79=$N$1,ROW($B$1:$B$79)),ROW(80:80)),6))","v":""},{"$f":"IF(ISERROR(INDEX($A$1:$G$79,SMALL(IF($B$1:$B$79=$N$1,ROW($B$1:$B$79)),ROW(80:80)),4)),\"\",INDEX($A$1:$G$79,SMALL(IF($B$1:$B$79=$N$1,ROW($B$1:$B$79)),ROW(80:80)),4))","v":""},{"$f":"IF(ISERROR(INDEX($A$1:$G$79,SMALL(IF($B$1:$B$79=$N$1,ROW($B$1:$B$79)),ROW(80:80)),5)),\"\",INDEX($A$1:$G$79,SMALL(IF($B$1:$B$79=$N$1,ROW($B$1:$B$79)),ROW(80:80)),5))","v":""},{"$f":"IF(ISERROR(INDEX($A$1:$G$79,SMALL(IF($B$1:$B$79=$N$1,ROW($B$1:$B$79)),ROW(80:80)),7)),\"\",INDEX($A$1:$G$79,SMALL(IF($B$1:$B$79=$N$1,ROW($B$1:$B$79)),ROW(80:80)),7))","v":""},{"$f":"IF(ISERROR(INDEX($A$1:$H$79,SMALL(IF($B$1:$B$79=$N$1,ROW($B$1:$B$79)),ROW(80:80)),8)),\"\",INDEX($A$1:$H$79,SMALL(IF($B$1:$B$79=$N$1,ROW($B$1:$B$79)),ROW(80:80)),8))","v":""},{"$f":"IF(ISERROR(INDEX($A$1:$G$79,SMALL(IF($C$1:$C$79=$S$1,ROW($C$1:$C$79)),ROW(80:80)),6)),\"\",INDEX($A$1:$G$79,SMALL(IF($C$1:$C$79=$S$1,ROW($C$1:$C$79)),ROW(80:80)),6))","v":""},{"$f":"IF(ISERROR(INDEX($A$1:$G$79,SMALL(IF($C$1:$C$79=$S$1,ROW($C$1:$C$79)),ROW(80:80)),4)),\"\",INDEX($A$1:$G$79,SMALL(IF($C$1:$C$79=$S$1,ROW($C$1:$C$79)),ROW(80:80)),4))","v":""},{"$f":"IF(ISERROR(INDEX($A$1:$G$79,SMALL(IF($C$1:$C$79=$S$1,ROW($C$1:$C$79)),ROW(80:80)),5)),\"\",INDEX($A$1:$G$79,SMALL(IF($C$1:$C$79=$S$1,ROW($C$1:$C$79)),ROW(80:80)),5))","v":""},{"$f":"IF(ISERROR(INDEX($A$1:$G$79,SMALL(IF($C$1:$C$79=$S$1,ROW($C$1:$C$79)),ROW(80:80)),7)),\"\",INDEX($A$1:$G$79,SMALL(IF($C$1:$C$79=$S$1,ROW($C$1:$C$79)),ROW(80:80)),7))","v":""},{"$f":"IF(ISERROR(INDEX($A$1:$H$79,SMALL(IF($C$1:$C$79=$S$1,ROW($C$1:$C$79)),ROW(80:80)),8)),\"\",INDEX($A$1:$H$79,SMALL(IF($C$1:$C$79=$S$1,ROW($C$1:$C$79)),ROW(80:80)),8))","v":""}," "]
[null,null,null,null,null,null,null,null,{"$f":"IF(ISERROR(INDEX($A$1:$G$79,SMALL(IF($A$1:$A$79=$I$1,ROW($A$1:$A$79)),ROW(81:81)),7)),\"\",INDEX($A$1:$G$79,SMALL(IF($A$1:$A$79=$I$1,ROW($A$1:$A$79)),ROW(81:81)),7))","v":""},{"$f":"IF(ISERROR(INDEX($A$1:$G$79,SMALL(IF($A$1:$A$79=$I$1,ROW($A$1:$A$79)),ROW(81:81)),4)),\"\",INDEX($A$1:$G$79,SMALL(IF($A$1:$A$79=$I$1,ROW($A$1:$A$79)),ROW(81:81)),4))","v":""},{"$f":"IF(ISERROR(INDEX($A$1:$G$79,SMALL(IF($A$1:$A$79=$I$1,ROW($A$1:$A$79)),ROW(81:81)),5)),\"\",INDEX($A$1:$G$79,SMALL(IF($A$1:$A$79=$I$1,ROW($A$1:$A$79)),ROW(81:81)),5))","v":""},{"$f":"IF(ISERROR(INDEX($A$1:$G$79,SMALL(IF($A$1:$A$79=$I$1,ROW($A$1:$A$79)),ROW(81:81)),6)),\"\",INDEX($A$1:$G$79,SMALL(IF($A$1:$A$79=$I$1,ROW($A$1:$A$79)),ROW(81:81)),6))","v":""},{"$f":"IF(ISERROR(INDEX($A$1:$H$79,SMALL(IF($A$1:$A$79=$I$1,ROW($A$1:$A$79)),ROW(81:81)),8)),\"\",INDEX($A$1:$H$79,SMALL(IF($A$1:$A$79=$I$1,ROW($A$1:$A$79)),ROW(81:81)),8))","v":""},{"$f":"IF(ISERROR(INDEX($A$1:$G$79,SMALL(IF($B$1:$B$79=$N$1,ROW($B$1:$B$79)),ROW(81:81)),6)),\"\",INDEX($A$1:$G$79,SMALL(IF($B$1:$B$79=$N$1,ROW($B$1:$B$79)),ROW(81:81)),6))","v":""},{"$f":"IF(ISERROR(INDEX($A$1:$G$79,SMALL(IF($B$1:$B$79=$N$1,ROW($B$1:$B$79)),ROW(81:81)),4)),\"\",INDEX($A$1:$G$79,SMALL(IF($B$1:$B$79=$N$1,ROW($B$1:$B$79)),ROW(81:81)),4))","v":""},{"$f":"IF(ISERROR(INDEX($A$1:$G$79,SMALL(IF($B$1:$B$79=$N$1,ROW($B$1:$B$79)),ROW(81:81)),5)),\"\",INDEX($A$1:$G$79,SMALL(IF($B$1:$B$79=$N$1,ROW($B$1:$B$79)),ROW(81:81)),5))","v":""},{"$f":"IF(ISERROR(INDEX($A$1:$G$79,SMALL(IF($B$1:$B$79=$N$1,ROW($B$1:$B$79)),ROW(81:81)),7)),\"\",INDEX($A$1:$G$79,SMALL(IF($B$1:$B$79=$N$1,ROW($B$1:$B$79)),ROW(81:81)),7))","v":""},{"$f":"IF(ISERROR(INDEX($A$1:$H$79,SMALL(IF($B$1:$B$79=$N$1,ROW($B$1:$B$79)),ROW(81:81)),8)),\"\",INDEX($A$1:$H$79,SMALL(IF($B$1:$B$79=$N$1,ROW($B$1:$B$79)),ROW(81:81)),8))","v":""},{"$f":"IF(ISERROR(INDEX($A$1:$G$79,SMALL(IF($C$1:$C$79=$S$1,ROW($C$1:$C$79)),ROW(81:81)),6)),\"\",INDEX($A$1:$G$79,SMALL(IF($C$1:$C$79=$S$1,ROW($C$1:$C$79)),ROW(81:81)),6))","v":""},{"$f":"IF(ISERROR(INDEX($A$1:$G$79,SMALL(IF($C$1:$C$79=$S$1,ROW($C$1:$C$79)),ROW(81:81)),4)),\"\",INDEX($A$1:$G$79,SMALL(IF($C$1:$C$79=$S$1,ROW($C$1:$C$79)),ROW(81:81)),4))","v":""},{"$f":"IF(ISERROR(INDEX($A$1:$G$79,SMALL(IF($C$1:$C$79=$S$1,ROW($C$1:$C$79)),ROW(81:81)),5)),\"\",INDEX($A$1:$G$79,SMALL(IF($C$1:$C$79=$S$1,ROW($C$1:$C$79)),ROW(81:81)),5))","v":""},{"$f":"IF(ISERROR(INDEX($A$1:$G$79,SMALL(IF($C$1:$C$79=$S$1,ROW($C$1:$C$79)),ROW(81:81)),7)),\"\",INDEX($A$1:$G$79,SMALL(IF($C$1:$C$79=$S$1,ROW($C$1:$C$79)),ROW(81:81)),7))","v":""},{"$f":"IF(ISERROR(INDEX($A$1:$H$79,SMALL(IF($C$1:$C$79=$S$1,ROW($C$1:$C$79)),ROW(81:81)),8)),\"\",INDEX($A$1:$H$79,SMALL(IF($C$1:$C$79=$S$1,ROW($C$1:$C$79)),ROW(81:81)),8))","v":""}," "]
[null,null,null,null,null,null,null,null,{"$f":"IF(ISERROR(INDEX($A$1:$G$79,SMALL(IF($A$1:$A$79=$I$1,ROW($A$1:$A$79)),ROW(82:82)),7)),\"\",INDEX($A$1:$G$79,SMALL(IF($A$1:$A$79=$I$1,ROW($A$1:$A$79)),ROW(82:82)),7))","v":""},{"$f":"IF(ISERROR(INDEX($A$1:$G$79,SMALL(IF($A$1:$A$79=$I$1,ROW($A$1:$A$79)),ROW(82:82)),4)),\"\",INDEX($A$1:$G$79,SMALL(IF($A$1:$A$79=$I$1,ROW($A$1:$A$79)),ROW(82:82)),4))","v":""},{"$f":"IF(ISERROR(INDEX($A$1:$G$79,SMALL(IF($A$1:$A$79=$I$1,ROW($A$1:$A$79)),ROW(82:82)),5)),\"\",INDEX($A$1:$G$79,SMALL(IF($A$1:$A$79=$I$1,ROW($A$1:$A$79)),ROW(82:82)),5))","v":""},{"$f":"IF(ISERROR(INDEX($A$1:$G$79,SMALL(IF($A$1:$A$79=$I$1,ROW($A$1:$A$79)),ROW(82:82)),6)),\"\",INDEX($A$1:$G$79,SMALL(IF($A$1:$A$79=$I$1,ROW($A$1:$A$79)),ROW(82:82)),6))","v":""},{"$f":"IF(ISERROR(INDEX($A$1:$H$79,SMALL(IF($A$1:$A$79=$I$1,ROW($A$1:$A$79)),ROW(82:82)),8)),\"\",INDEX($A$1:$H$79,SMALL(IF($A$1:$A$79=$I$1,ROW($A$1:$A$79)),ROW(82:82)),8))","v":""},{"$f":"IF(ISERROR(INDEX($A$1:$G$79,SMALL(IF($B$1:$B$79=$N$1,ROW($B$1:$B$79)),ROW(82:82)),6)),\"\",INDEX($A$1:$G$79,SMALL(IF($B$1:$B$79=$N$1,ROW($B$1:$B$79)),ROW(82:82)),6))","v":""},{"$f":"IF(ISERROR(INDEX($A$1:$G$79,SMALL(IF($B$1:$B$79=$N$1,ROW($B$1:$B$79)),ROW(82:82)),4)),\"\",INDEX($A$1:$G$79,SMALL(IF($B$1:$B$79=$N$1,ROW($B$1:$B$79)),ROW(82:82)),4))","v":""},{"$f":"IF(ISERROR(INDEX($A$1:$G$79,SMALL(IF($B$1:$B$79=$N$1,ROW($B$1:$B$79)),ROW(82:82)),5)),\"\",INDEX($A$1:$G$79,SMALL(IF($B$1:$B$79=$N$1,ROW($B$1:$B$79)),ROW(82:82)),5))","v":""},{"$f":"IF(ISERROR(INDEX($A$1:$G$79,SMALL(IF($B$1:$B$79=$N$1,ROW($B$1:$B$79)),ROW(82:82)),7)),\"\",INDEX($A$1:$G$79,SMALL(IF($B$1:$B$79=$N$1,ROW($B$1:$B$79)),ROW(82:82)),7))","v":""},{"$f":"IF(ISERROR(INDEX($A$1:$H$79,SMALL(IF($B$1:$B$79=$N$1,ROW($B$1:$B$79)),ROW(82:82)),8)),\"\",INDEX($A$1:$H$79,SMALL(IF($B$1:$B$79=$N$1,ROW($B$1:$B$79)),ROW(82:82)),8))","v":""},{"$f":"IF(ISERROR(INDEX($A$1:$G$79,SMALL(IF($C$1:$C$79=$S$1,ROW($C$1:$C$79)),ROW(82:82)),6)),\"\",INDEX($A$1:$G$79,SMALL(IF($C$1:$C$79=$S$1,ROW($C$1:$C$79)),ROW(82:82)),6))","v":""},{"$f":"IF(ISERROR(INDEX($A$1:$G$79,SMALL(IF($C$1:$C$79=$S$1,ROW($C$1:$C$79)),ROW(82:82)),4)),\"\",INDEX($A$1:$G$79,SMALL(IF($C$1:$C$79=$S$1,ROW($C$1:$C$79)),ROW(82:82)),4))","v":""},{"$f":"IF(ISERROR(INDEX($A$1:$G$79,SMALL(IF($C$1:$C$79=$S$1,ROW($C$1:$C$79)),ROW(82:82)),5)),\"\",INDEX($A$1:$G$79,SMALL(IF($C$1:$C$79=$S$1,ROW($C$1:$C$79)),ROW(82:82)),5))","v":""},{"$f":"IF(ISERROR(INDEX($A$1:$G$79,SMALL(IF($C$1:$C$79=$S$1,ROW($C$1:$C$79)),ROW(82:82)),7)),\"\",INDEX($A$1:$G$79,SMALL(IF($C$1:$C$79=$S$1,ROW($C$1:$C$79)),ROW(82:82)),7))","v":""},{"$f":"IF(ISERROR(INDEX($A$1:$H$79,SMALL(IF($C$1:$C$79=$S$1,ROW($C$1:$C$79)),ROW(82:82)),8)),\"\",INDEX($A$1:$H$79,SMALL(IF($C$1:$C$79=$S$1,ROW($C$1:$C$79)),ROW(82:82)),8))","v":""}," "]
[null,null,null,null,null,null,null,null,{"$f":"IF(ISERROR(INDEX($A$1:$G$79,SMALL(IF($A$1:$A$79=$I$1,ROW($A$1:$A$79)),ROW(83:83)),7)),\"\",INDEX($A$1:$G$79,SMALL(IF($A$1:$A$79=$I$1,ROW($A$1:$A$79)),ROW(83:83)),7))","v":""},{"$f":"IF(ISERROR(INDEX($A$1:$G$79,SMALL(IF($A$1:$A$79=$I$1,ROW($A$1:$A$79)),ROW(83:83)),4)),\"\",INDEX($A$1:$G$79,SMALL(IF($A$1:$A$79=$I$1,ROW($A$1:$A$79)),ROW(83:83)),4))","v":""},{"$f":"IF(ISERROR(INDEX($A$1:$G$79,SMALL(IF($A$1:$A$79=$I$1,ROW($A$1:$A$79)),ROW(83:83)),5)),\"\",INDEX($A$1:$G$79,SMALL(IF($A$1:$A$79=$I$1,ROW($A$1:$A$79)),ROW(83:83)),5))","v":""},{"$f":"IF(ISERROR(INDEX($A$1:$G$79,SMALL(IF($A$1:$A$79=$I$1,ROW($A$1:$A$79)),ROW(83:83)),6)),\"\",INDEX($A$1:$G$79,SMALL(IF($A$1:$A$79=$I$1,ROW($A$1:$A$79)),ROW(83:83)),6))","v":""},{"$f":"IF(ISERROR(INDEX($A$1:$H$79,SMALL(IF($A$1:$A$79=$I$1,ROW($A$1:$A$79)),ROW(83:83)),8)),\"\",INDEX($A$1:$H$79,SMALL(IF($A$1:$A$79=$I$1,ROW($A$1:$A$79)),ROW(83:83)),8))","v":""},{"$f":"IF(ISERROR(INDEX($A$1:$G$79,SMALL(IF($B$1:$B$79=$N$1,ROW($B$1:$B$79)),ROW(83:83)),6)),\"\",INDEX($A$1:$G$79,SMALL(IF($B$1:$B$79=$N$1,ROW($B$1:$B$79)),ROW(83:83)),6))","v":""},{"$f":"IF(ISERROR(INDEX($A$1:$G$79,SMALL(IF($B$1:$B$79=$N$1,ROW($B$1:$B$79)),ROW(83:83)),4)),\"\",INDEX($A$1:$G$79,SMALL(IF($B$1:$B$79=$N$1,ROW($B$1:$B$79)),ROW(83:83)),4))","v":""},{"$f":"IF(ISERROR(INDEX($A$1:$G$79,SMALL(IF($B$1:$B$79=$N$1,ROW($B$1:$B$79)),ROW(83:83)),5)),\"\",INDEX($A$1:$G$79,SMALL(IF($B$1:$B$79=$N$1,ROW($B$1:$B$79)),ROW(83:83)),5))","v":""},{"$f":"IF(ISERROR(INDEX($A$1:$G$79,SMALL(IF($B$1:$B$79=$N$1,ROW($B$1:$B$79)),ROW(83:83)),7)),\"\",INDEX($A$1:$G$79,SMALL(IF($B$1:$B$79=$N$1,ROW($B$1:$B$79)),ROW(83:83)),7))","v":""},{"$f":"IF(ISERROR(INDEX($A$1:$H$79,SMALL(IF($B$1:$B$79=$N$1,ROW($B$1:$B$79)),ROW(83:83)),8)),\"\",INDEX($A$1:$H$79,SMALL(IF($B$1:$B$79=$N$1,ROW($B$1:$B$79)),ROW(83:83)),8))","v":""},{"$f":"IF(ISERROR(INDEX($A$1:$G$79,SMALL(IF($C$1:$C$79=$S$1,ROW($C$1:$C$79)),ROW(83:83)),6)),\"\",INDEX($A$1:$G$79,SMALL(IF($C$1:$C$79=$S$1,ROW($C$1:$C$79)),ROW(83:83)),6))","v":""},{"$f":"IF(ISERROR(INDEX($A$1:$G$79,SMALL(IF($C$1:$C$79=$S$1,ROW($C$1:$C$79)),ROW(83:83)),4)),\"\",INDEX($A$1:$G$79,SMALL(IF($C$1:$C$79=$S$1,ROW($C$1:$C$79)),ROW(83:83)),4))","v":""},{"$f":"IF(ISERROR(INDEX($A$1:$G$79,SMALL(IF($C$1:$C$79=$S$1,ROW($C$1:$C$79)),ROW(83:83)),5)),\"\",INDEX($A$1:$G$79,SMALL(IF($C$1:$C$79=$S$1,ROW($C$1:$C$79)),ROW(83:83)),5))","v":""},{"$f":"IF(ISERROR(INDEX($A$1:$G$79,SMALL(IF($C$1:$C$79=$S$1,ROW($C$1:$C$79)),ROW(83:83)),7)),\"\",INDEX($A$1:$G$79,SMALL(IF($C$1:$C$79=$S$1,ROW($C$1:$C$79)),ROW(83:83)),7))","v":""},{"$f":"IF(ISERROR(INDEX($A$1:$H$79,SMALL(IF($C$1:$C$79=$S$1,ROW($C$1:$C$79)),ROW(83:83)),8)),\"\",INDEX($A$1:$H$79,SMALL(IF($C$1:$C$79=$S$1,ROW($C$1:$C$79)),ROW(83:83)),8))","v":""}," "]
[null,null,null,null,null,null,null,null,{"$f":"IF(ISERROR(INDEX($A$1:$G$79,SMALL(IF($A$1:$A$79=$I$1,ROW($A$1:$A$79)),ROW(84:84)),7)),\"\",INDEX($A$1:$G$79,SMALL(IF($A$1:$A$79=$I$1,ROW($A$1:$A$79)),ROW(84:84)),7))","v":""},{"$f":"IF(ISERROR(INDEX($A$1:$G$79,SMALL(IF($A$1:$A$79=$I$1,ROW($A$1:$A$79)),ROW(84:84)),4)),\"\",INDEX($A$1:$G$79,SMALL(IF($A$1:$A$79=$I$1,ROW($A$1:$A$79)),ROW(84:84)),4))","v":""},{"$f":"IF(ISERROR(INDEX($A$1:$G$79,SMALL(IF($A$1:$A$79=$I$1,ROW($A$1:$A$79)),ROW(84:84)),5)),\"\",INDEX($A$1:$G$79,SMALL(IF($A$1:$A$79=$I$1,ROW($A$1:$A$79)),ROW(84:84)),5))","v":""},{"$f":"IF(ISERROR(INDEX($A$1:$G$79,SMALL(IF($A$1:$A$79=$I$1,ROW($A$1:$A$79)),ROW(84:84)),6)),\"\",INDEX($A$1:$G$79,SMALL(IF($A$1:$A$79=$I$1,ROW($A$1:$A$79)),ROW(84:84)),6))","v":""},{"$f":"IF(ISERROR(INDEX($A$1:$H$79,SMALL(IF($A$1:$A$79=$I$1,ROW($A$1:$A$79)),ROW(84:84)),8)),\"\",INDEX($A$1:$H$79,SMALL(IF($A$1:$A$79=$I$1,ROW($A$1:$A$79)),ROW(84:84)),8))","v":""},{"$f":"IF(ISERROR(INDEX($A$1:$G$79,SMALL(IF($B$1:$B$79=$N$1,ROW($B$1:$B$79)),ROW(84:84)),6)),\"\",INDEX($A$1:$G$79,SMALL(IF($B$1:$B$79=$N$1,ROW($B$1:$B$79)),ROW(84:84)),6))","v":""},{"$f":"IF(ISERROR(INDEX($A$1:$G$79,SMALL(IF($B$1:$B$79=$N$1,ROW($B$1:$B$79)),ROW(84:84)),4)),\"\",INDEX($A$1:$G$79,SMALL(IF($B$1:$B$79=$N$1,ROW($B$1:$B$79)),ROW(84:84)),4))","v":""},{"$f":"IF(ISERROR(INDEX($A$1:$G$79,SMALL(IF($B$1:$B$79=$N$1,ROW($B$1:$B$79)),ROW(84:84)),5)),\"\",INDEX($A$1:$G$79,SMALL(IF($B$1:$B$79=$N$1,ROW($B$1:$B$79)),ROW(84:84)),5))","v":""},{"$f":"IF(ISERROR(INDEX($A$1:$G$79,SMALL(IF($B$1:$B$79=$N$1,ROW($B$1:$B$79)),ROW(84:84)),7)),\"\",INDEX($A$1:$G$79,SMALL(IF($B$1:$B$79=$N$1,ROW($B$1:$B$79)),ROW(84:84)),7))","v":""},{"$f":"IF(ISERROR(INDEX($A$1:$H$79,SMALL(IF($B$1:$B$79=$N$1,ROW($B$1:$B$79)),ROW(84:84)),8)),\"\",INDEX($A$1:$H$79,SMALL(IF($B$1:$B$79=$N$1,ROW($B$1:$B$79)),ROW(84:84)),8))","v":""},{"$f":"IF(ISERROR(INDEX($A$1:$G$79,SMALL(IF($C$1:$C$79=$S$1,ROW($C$1:$C$79)),ROW(84:84)),6)),\"\",INDEX($A$1:$G$79,SMALL(IF($C$1:$C$79=$S$1,ROW($C$1:$C$79)),ROW(84:84)),6))","v":""},{"$f":"IF(ISERROR(INDEX($A$1:$G$79,SMALL(IF($C$1:$C$79=$S$1,ROW($C$1:$C$79)),ROW(84:84)),4)),\"\",INDEX($A$1:$G$79,SMALL(IF($C$1:$C$79=$S$1,ROW($C$1:$C$79)),ROW(84:84)),4))","v":""},{"$f":"IF(ISERROR(INDEX($A$1:$G$79,SMALL(IF($C$1:$C$79=$S$1,ROW($C$1:$C$79)),ROW(84:84)),5)),\"\",INDEX($A$1:$G$79,SMALL(IF($C$1:$C$79=$S$1,ROW($C$1:$C$79)),ROW(84:84)),5))","v":""},{"$f":"IF(ISERROR(INDEX($A$1:$G$79,SMALL(IF($C$1:$C$79=$S$1,ROW($C$1:$C$79)),ROW(84:84)),7)),\"\",INDEX($A$1:$G$79,SMALL(IF($C$1:$C$79=$S$1,ROW($C$1:$C$79)),ROW(84:84)),7))","v":""},{"$f":"IF(ISERROR(INDEX($A$1:$H$79,SMALL(IF($C$1:$C$79=$S$1,ROW($C$1:$C$79)),ROW(84:84)),8)),\"\",INDEX($A$1:$H$79,SMALL(IF($C$1:$C$79=$S$1,ROW($C$1:$C$79)),ROW(84:84)),8))","v":""}," "]
[null,null,null,null,null,null,null,null,{"$f":"IF(ISERROR(INDEX($A$1:$G$79,SMALL(IF($A$1:$A$79=$I$1,ROW($A$1:$A$79)),ROW(85:85)),7)),\"\",INDEX($A$1:$G$79,SMALL(IF($A$1:$A$79=$I$1,ROW($A$1:$A$79)),ROW(85:85)),7))","v":""},{"$f":"IF(ISERROR(INDEX($A$1:$G$79,SMALL(IF($A$1:$A$79=$I$1,ROW($A$1:$A$79)),ROW(85:85)),4)),\"\",INDEX($A$1:$G$79,SMALL(IF($A$1:$A$79=$I$1,ROW($A$1:$A$79)),ROW(85:85)),4))","v":""},{"$f":"IF(ISERROR(INDEX($A$1:$G$79,SMALL(IF($A$1:$A$79=$I$1,ROW($A$1:$A$79)),ROW(85:85)),5)),\"\",INDEX($A$1:$G$79,SMALL(IF($A$1:$A$79=$I$1,ROW($A$1:$A$79)),ROW(85:85)),5))","v":""},{"$f":"IF(ISERROR(INDEX($A$1:$G$79,SMALL(IF($A$1:$A$79=$I$1,ROW($A$1:$A$79)),ROW(85:85)),6)),\"\",INDEX($A$1:$G$79,SMALL(IF($A$1:$A$79=$I$1,ROW($A$1:$A$79)),ROW(85:85)),6))","v":""},{"$f":"IF(ISERROR(INDEX($A$1:$H$79,SMALL(IF($A$1:$A$79=$I$1,ROW($A$1:$A$79)),ROW(85:85)),8)),\"\",INDEX($A$1:$H$79,SMALL(IF($A$1:$A$79=$I$1,ROW($A$1:$A$79)),ROW(85:85)),8))","v":""},{"$f":"IF(ISERROR(INDEX($A$1:$G$79,SMALL(IF($B$1:$B$79=$N$1,ROW($B$1:$B$79)),ROW(85:85)),6)),\"\",INDEX($A$1:$G$79,SMALL(IF($B$1:$B$79=$N$1,ROW($B$1:$B$79)),ROW(85:85)),6))","v":""},{"$f":"IF(ISERROR(INDEX($A$1:$G$79,SMALL(IF($B$1:$B$79=$N$1,ROW($B$1:$B$79)),ROW(85:85)),4)),\"\",INDEX($A$1:$G$79,SMALL(IF($B$1:$B$79=$N$1,ROW($B$1:$B$79)),ROW(85:85)),4))","v":""},{"$f":"IF(ISERROR(INDEX($A$1:$G$79,SMALL(IF($B$1:$B$79=$N$1,ROW($B$1:$B$79)),ROW(85:85)),5)),\"\",INDEX($A$1:$G$79,SMALL(IF($B$1:$B$79=$N$1,ROW($B$1:$B$79)),ROW(85:85)),5))","v":""},{"$f":"IF(ISERROR(INDEX($A$1:$G$79,SMALL(IF($B$1:$B$79=$N$1,ROW($B$1:$B$79)),ROW(85:85)),7)),\"\",INDEX($A$1:$G$79,SMALL(IF($B$1:$B$79=$N$1,ROW($B$1:$B$79)),ROW(85:85)),7))","v":""},{"$f":"IF(ISERROR(INDEX($A$1:$H$79,SMALL(IF($B$1:$B$79=$N$1,ROW($B$1:$B$79)),ROW(85:85)),8)),\"\",INDEX($A$1:$H$79,SMALL(IF($B$1:$B$79=$N$1,ROW($B$1:$B$79)),ROW(85:85)),8))","v":""},{"$f":"IF(ISERROR(INDEX($A$1:$G$79,SMALL(IF($C$1:$C$79=$S$1,ROW($C$1:$C$79)),ROW(85:85)),6)),\"\",INDEX($A$1:$G$79,SMALL(IF($C$1:$C$79=$S$1,ROW($C$1:$C$79)),ROW(85:85)),6))","v":""},{"$f":"IF(ISERROR(INDEX($A$1:$G$79,SMALL(IF($C$1:$C$79=$S$1,ROW($C$1:$C$79)),ROW(85:85)),4)),\"\",INDEX($A$1:$G$79,SMALL(IF($C$1:$C$79=$S$1,ROW($C$1:$C$79)),ROW(85:85)),4))","v":""},{"$f":"IF(ISERROR(INDEX($A$1:$G$79,SMALL(IF($C$1:$C$79=$S$1,ROW($C$1:$C$79)),ROW(85:85)),5)),\"\",INDEX($A$1:$G$79,SMALL(IF($C$1:$C$79=$S$1,ROW($C$1:$C$79)),ROW(85:85)),5))","v":""},{"$f":"IF(ISERROR(INDEX($A$1:$G$79,SMALL(IF($C$1:$C$79=$S$1,ROW($C$1:$C$79)),ROW(85:85)),7)),\"\",INDEX($A$1:$G$79,SMALL(IF($C$1:$C$79=$S$1,ROW($C$1:$C$79)),ROW(85:85)),7))","v":""},{"$f":"IF(ISERROR(INDEX($A$1:$H$79,SMALL(IF($C$1:$C$79=$S$1,ROW($C$1:$C$79)),ROW(85:85)),8)),\"\",INDEX($A$1:$H$79,SMALL(IF($C$1:$C$79=$S$1,ROW($C$1:$C$79)),ROW(85:85)),8))","v":""}," "]
[null,null,null,null,null,null,null,null,{"$f":"IF(ISERROR(INDEX($A$1:$G$79,SMALL(IF($A$1:$A$79=$I$1,ROW($A$1:$A$79)),ROW(86:86)),7)),\"\",INDEX($A$1:$G$79,SMALL(IF($A$1:$A$79=$I$1,ROW($A$1:$A$79)),ROW(86:86)),7))","v":""},{"$f":"IF(ISERROR(INDEX($A$1:$G$79,SMALL(IF($A$1:$A$79=$I$1,ROW($A$1:$A$79)),ROW(86:86)),4)),\"\",INDEX($A$1:$G$79,SMALL(IF($A$1:$A$79=$I$1,ROW($A$1:$A$79)),ROW(86:86)),4))","v":""},{"$f":"IF(ISERROR(INDEX($A$1:$G$79,SMALL(IF($A$1:$A$79=$I$1,ROW($A$1:$A$79)),ROW(86:86)),5)),\"\",INDEX($A$1:$G$79,SMALL(IF($A$1:$A$79=$I$1,ROW($A$1:$A$79)),ROW(86:86)),5))","v":""},{"$f":"IF(ISERROR(INDEX($A$1:$G$79,SMALL(IF($A$1:$A$79=$I$1,ROW($A$1:$A$79)),ROW(86:86)),6)),\"\",INDEX($A$1:$G$79,SMALL(IF($A$1:$A$79=$I$1,ROW($A$1:$A$79)),ROW(86:86)),6))","v":""},{"$f":"IF(ISERROR(INDEX($A$1:$H$79,SMALL(IF($A$1:$A$79=$I$1,ROW($A$1:$A$79)),ROW(86:86)),8)),\"\",INDEX($A$1:$H$79,SMALL(IF($A$1:$A$79=$I$1,ROW($A$1:$A$79)),ROW(86:86)),8))","v":""},{"$f":"IF(ISERROR(INDEX($A$1:$G$79,SMALL(IF($B$1:$B$79=$N$1,ROW($B$1:$B$79)),ROW(86:86)),6)),\"\",INDEX($A$1:$G$79,SMALL(IF($B$1:$B$79=$N$1,ROW($B$1:$B$79)),ROW(86:86)),6))","v":""},{"$f":"IF(ISERROR(INDEX($A$1:$G$79,SMALL(IF($B$1:$B$79=$N$1,ROW($B$1:$B$79)),ROW(86:86)),4)),\"\",INDEX($A$1:$G$79,SMALL(IF($B$1:$B$79=$N$1,ROW($B$1:$B$79)),ROW(86:86)),4))","v":""},{"$f":"IF(ISERROR(INDEX($A$1:$G$79,SMALL(IF($B$1:$B$79=$N$1,ROW($B$1:$B$79)),ROW(86:86)),5)),\"\",INDEX($A$1:$G$79,SMALL(IF($B$1:$B$79=$N$1,ROW($B$1:$B$79)),ROW(86:86)),5))","v":""},{"$f":"IF(ISERROR(INDEX($A$1:$G$79,SMALL(IF($B$1:$B$79=$N$1,ROW($B$1:$B$79)),ROW(86:86)),7)),\"\",INDEX($A$1:$G$79,SMALL(IF($B$1:$B$79=$N$1,ROW($B$1:$B$79)),ROW(86:86)),7))","v":""},{"$f":"IF(ISERROR(INDEX($A$1:$H$79,SMALL(IF($B$1:$B$79=$N$1,ROW($B$1:$B$79)),ROW(86:86)),8)),\"\",INDEX($A$1:$H$79,SMALL(IF($B$1:$B$79=$N$1,ROW($B$1:$B$79)),ROW(86:86)),8))","v":""},{"$f":"IF(ISERROR(INDEX($A$1:$G$79,SMALL(IF($C$1:$C$79=$S$1,ROW($C$1:$C$79)),ROW(86:86)),6)),\"\",INDEX($A$1:$G$79,SMALL(IF($C$1:$C$79=$S$1,ROW($C$1:$C$79)),ROW(86:86)),6))","v":""},{"$f":"IF(ISERROR(INDEX($A$1:$G$79,SMALL(IF($C$1:$C$79=$S$1,ROW($C$1:$C$79)),ROW(86:86)),4)),\"\",INDEX($A$1:$G$79,SMALL(IF($C$1:$C$79=$S$1,ROW($C$1:$C$79)),ROW(86:86)),4))","v":""},{"$f":"IF(ISERROR(INDEX($A$1:$G$79,SMALL(IF($C$1:$C$79=$S$1,ROW($C$1:$C$79)),ROW(86:86)),5)),\"\",INDEX($A$1:$G$79,SMALL(IF($C$1:$C$79=$S$1,ROW($C$1:$C$79)),ROW(86:86)),5))","v":""},{"$f":"IF(ISERROR(INDEX($A$1:$G$79,SMALL(IF($C$1:$C$79=$S$1,ROW($C$1:$C$79)),ROW(86:86)),7)),\"\",INDEX($A$1:$G$79,SMALL(IF($C$1:$C$79=$S$1,ROW($C$1:$C$79)),ROW(86:86)),7))","v":""},{"$f":"IF(ISERROR(INDEX($A$1:$H$79,SMALL(IF($C$1:$C$79=$S$1,ROW($C$1:$C$79)),ROW(86:86)),8)),\"\",INDEX($A$1:$H$79,SMALL(IF($C$1:$C$79=$S$1,ROW($C$1:$C$79)),ROW(86:86)),8))","v":""}," "]
[null,null,null,null,null,null,null,null,{"$f":"IF(ISERROR(INDEX($A$1:$G$79,SMALL(IF($A$1:$A$79=$I$1,ROW($A$1:$A$79)),ROW(87:87)),7)),\"\",INDEX($A$1:$G$79,SMALL(IF($A$1:$A$79=$I$1,ROW($A$1:$A$79)),ROW(87:87)),7))","v":""},{"$f":"IF(ISERROR(INDEX($A$1:$G$79,SMALL(IF($A$1:$A$79=$I$1,ROW($A$1:$A$79)),ROW(87:87)),4)),\"\",INDEX($A$1:$G$79,SMALL(IF($A$1:$A$79=$I$1,ROW($A$1:$A$79)),ROW(87:87)),4))","v":""},{"$f":"IF(ISERROR(INDEX($A$1:$G$79,SMALL(IF($A$1:$A$79=$I$1,ROW($A$1:$A$79)),ROW(87:87)),5)),\"\",INDEX($A$1:$G$79,SMALL(IF($A$1:$A$79=$I$1,ROW($A$1:$A$79)),ROW(87:87)),5))","v":""},{"$f":"IF(ISERROR(INDEX($A$1:$G$79,SMALL(IF($A$1:$A$79=$I$1,ROW($A$1:$A$79)),ROW(87:87)),6)),\"\",INDEX($A$1:$G$79,SMALL(IF($A$1:$A$79=$I$1,ROW($A$1:$A$79)),ROW(87:87)),6))","v":""},{"$f":"IF(ISERROR(INDEX($A$1:$H$79,SMALL(IF($A$1:$A$79=$I$1,ROW($A$1:$A$79)),ROW(87:87)),8)),\"\",INDEX($A$1:$H$79,SMALL(IF($A$1:$A$79=$I$1,ROW($A$1:$A$79)),ROW(87:87)),8))","v":""},{"$f":"IF(ISERROR(INDEX($A$1:$G$79,SMALL(IF($B$1:$B$79=$N$1,ROW($B$1:$B$79)),ROW(87:87)),6)),\"\",INDEX($A$1:$G$79,SMALL(IF($B$1:$B$79=$N$1,ROW($B$1:$B$79)),ROW(87:87)),6))","v":""},{"$f":"IF(ISERROR(INDEX($A$1:$G$79,SMALL(IF($B$1:$B$79=$N$1,ROW($B$1:$B$79)),ROW(87:87)),4)),\"\",INDEX($A$1:$G$79,SMALL(IF($B$1:$B$79=$N$1,ROW($B$1:$B$79)),ROW(87:87)),4))","v":""},{"$f":"IF(ISERROR(INDEX($A$1:$G$79,SMALL(IF($B$1:$B$79=$N$1,ROW($B$1:$B$79)),ROW(87:87)),5)),\"\",INDEX($A$1:$G$79,SMALL(IF($B$1:$B$79=$N$1,ROW($B$1:$B$79)),ROW(87:87)),5))","v":""},{"$f":"IF(ISERROR(INDEX($A$1:$G$79,SMALL(IF($B$1:$B$79=$N$1,ROW($B$1:$B$79)),ROW(87:87)),7)),\"\",INDEX($A$1:$G$79,SMALL(IF($B$1:$B$79=$N$1,ROW($B$1:$B$79)),ROW(87:87)),7))","v":""},{"$f":"IF(ISERROR(INDEX($A$1:$H$79,SMALL(IF($B$1:$B$79=$N$1,ROW($B$1:$B$79)),ROW(87:87)),8)),\"\",INDEX($A$1:$H$79,SMALL(IF($B$1:$B$79=$N$1,ROW($B$1:$B$79)),ROW(87:87)),8))","v":""},{"$f":"IF(ISERROR(INDEX($A$1:$G$79,SMALL(IF($C$1:$C$79=$S$1,ROW($C$1:$C$79)),ROW(87:87)),6)),\"\",INDEX($A$1:$G$79,SMALL(IF($C$1:$C$79=$S$1,ROW($C$1:$C$79)),ROW(87:87)),6))","v":""},{"$f":"IF(ISERROR(INDEX($A$1:$G$79,SMALL(IF($C$1:$C$79=$S$1,ROW($C$1:$C$79)),ROW(87:87)),4)),\"\",INDEX($A$1:$G$79,SMALL(IF($C$1:$C$79=$S$1,ROW($C$1:$C$79)),ROW(87:87)),4))","v":""},{"$f":"IF(ISERROR(INDEX($A$1:$G$79,SMALL(IF($C$1:$C$79=$S$1,ROW($C$1:$C$79)),ROW(87:87)),5)),\"\",INDEX($A$1:$G$79,SMALL(IF($C$1:$C$79=$S$1,ROW($C$1:$C$79)),ROW(87:87)),5))","v":""},{"$f":"IF(ISERROR(INDEX($A$1:$G$79,SMALL(IF($C$1:$C$79=$S$1,ROW($C$1:$C$79)),ROW(87:87)),7)),\"\",INDEX($A$1:$G$79,SMALL(IF($C$1:$C$79=$S$1,ROW($C$1:$C$79)),ROW(87:87)),7))","v":""},{"$f":"IF(ISERROR(INDEX($A$1:$H$79,SMALL(IF($C$1:$C$79=$S$1,ROW($C$1:$C$79)),ROW(87:87)),8)),\"\",INDEX($A$1:$H$79,SMALL(IF($C$1:$C$79=$S$1,ROW($C$1:$C$79)),ROW(87:87)),8))","v":""}," "]
[null,null,null,null,null,null,null,null,{"$f":"IF(ISERROR(INDEX($A$1:$G$79,SMALL(IF($A$1:$A$79=$I$1,ROW($A$1:$A$79)),ROW(88:88)),7)),\"\",INDEX($A$1:$G$79,SMALL(IF($A$1:$A$79=$I$1,ROW($A$1:$A$79)),ROW(88:88)),7))","v":""},{"$f":"IF(ISERROR(INDEX($A$1:$G$79,SMALL(IF($A$1:$A$79=$I$1,ROW($A$1:$A$79)),ROW(88:88)),4)),\"\",INDEX($A$1:$G$79,SMALL(IF($A$1:$A$79=$I$1,ROW($A$1:$A$79)),ROW(88:88)),4))","v":""},{"$f":"IF(ISERROR(INDEX($A$1:$G$79,SMALL(IF($A$1:$A$79=$I$1,ROW($A$1:$A$79)),ROW(88:88)),5)),\"\",INDEX($A$1:$G$79,SMALL(IF($A$1:$A$79=$I$1,ROW($A$1:$A$79)),ROW(88:88)),5))","v":""},{"$f":"IF(ISERROR(INDEX($A$1:$G$79,SMALL(IF($A$1:$A$79=$I$1,ROW($A$1:$A$79)),ROW(88:88)),6)),\"\",INDEX($A$1:$G$79,SMALL(IF($A$1:$A$79=$I$1,ROW($A$1:$A$79)),ROW(88:88)),6))","v":""},{"$f":"IF(ISERROR(INDEX($A$1:$H$79,SMALL(IF($A$1:$A$79=$I$1,ROW($A$1:$A$79)),ROW(88:88)),8)),\"\",INDEX($A$1:$H$79,SMALL(IF($A$1:$A$79=$I$1,ROW($A$1:$A$79)),ROW(88:88)),8))","v":""},{"$f":"IF(ISERROR(INDEX($A$1:$G$79,SMALL(IF($B$1:$B$79=$N$1,ROW($B$1:$B$79)),ROW(88:88)),6)),\"\",INDEX($A$1:$G$79,SMALL(IF($B$1:$B$79=$N$1,ROW($B$1:$B$79)),ROW(88:88)),6))","v":""},{"$f":"IF(ISERROR(INDEX($A$1:$G$79,SMALL(IF($B$1:$B$79=$N$1,ROW($B$1:$B$79)),ROW(88:88)),4)),\"\",INDEX($A$1:$G$79,SMALL(IF($B$1:$B$79=$N$1,ROW($B$1:$B$79)),ROW(88:88)),4))","v":""},{"$f":"IF(ISERROR(INDEX($A$1:$G$79,SMALL(IF($B$1:$B$79=$N$1,ROW($B$1:$B$79)),ROW(88:88)),5)),\"\",INDEX($A$1:$G$79,SMALL(IF($B$1:$B$79=$N$1,ROW($B$1:$B$79)),ROW(88:88)),5))","v":""},{"$f":"IF(ISERROR(INDEX($A$1:$G$79,SMALL(IF($B$1:$B$79=$N$1,ROW($B$1:$B$79)),ROW(88:88)),7)),\"\",INDEX($A$1:$G$79,SMALL(IF($B$1:$B$79=$N$1,ROW($B$1:$B$79)),ROW(88:88)),7))","v":""},{"$f":"IF(ISERROR(INDEX($A$1:$H$79,SMALL(IF($B$1:$B$79=$N$1,ROW($B$1:$B$79)),ROW(88:88)),8)),\"\",INDEX($A$1:$H$79,SMALL(IF($B$1:$B$79=$N$1,ROW($B$1:$B$79)),ROW(88:88)),8))","v":""},{"$f":"IF(ISERROR(INDEX($A$1:$G$79,SMALL(IF($C$1:$C$79=$S$1,ROW($C$1:$C$79)),ROW(88:88)),6)),\"\",INDEX($A$1:$G$79,SMALL(IF($C$1:$C$79=$S$1,ROW($C$1:$C$79)),ROW(88:88)),6))","v":""},{"$f":"IF(ISERROR(INDEX($A$1:$G$79,SMALL(IF($C$1:$C$79=$S$1,ROW($C$1:$C$79)),ROW(88:88)),4)),\"\",INDEX($A$1:$G$79,SMALL(IF($C$1:$C$79=$S$1,ROW($C$1:$C$79)),ROW(88:88)),4))","v":""},{"$f":"IF(ISERROR(INDEX($A$1:$G$79,SMALL(IF($C$1:$C$79=$S$1,ROW($C$1:$C$79)),ROW(88:88)),5)),\"\",INDEX($A$1:$G$79,SMALL(IF($C$1:$C$79=$S$1,ROW($C$1:$C$79)),ROW(88:88)),5))","v":""},{"$f":"IF(ISERROR(INDEX($A$1:$G$79,SMALL(IF($C$1:$C$79=$S$1,ROW($C$1:$C$79)),ROW(88:88)),7)),\"\",INDEX($A$1:$G$79,SMALL(IF($C$1:$C$79=$S$1,ROW($C$1:$C$79)),ROW(88:88)),7))","v":""},{"$f":"IF(ISERROR(INDEX($A$1:$H$79,SMALL(IF($C$1:$C$79=$S$1,ROW($C$1:$C$79)),ROW(88:88)),8)),\"\",INDEX($A$1:$H$79,SMALL(IF($C$1:$C$79=$S$1,ROW($C$1:$C$79)),ROW(88:88)),8))","v":""}," "]
[null,null,null,null,null,null,null,null,{"$f":"IF(ISERROR(INDEX($A$1:$G$79,SMALL(IF($A$1:$A$79=$I$1,ROW($A$1:$A$79)),ROW(89:89)),7)),\"\",INDEX($A$1:$G$79,SMALL(IF($A$1:$A$79=$I$1,ROW($A$1:$A$79)),ROW(89:89)),7))","v":""},{"$f":"IF(ISERROR(INDEX($A$1:$G$79,SMALL(IF($A$1:$A$79=$I$1,ROW($A$1:$A$79)),ROW(89:89)),4)),\"\",INDEX($A$1:$G$79,SMALL(IF($A$1:$A$79=$I$1,ROW($A$1:$A$79)),ROW(89:89)),4))","v":""},{"$f":"IF(ISERROR(INDEX($A$1:$G$79,SMALL(IF($A$1:$A$79=$I$1,ROW($A$1:$A$79)),ROW(89:89)),5)),\"\",INDEX($A$1:$G$79,SMALL(IF($A$1:$A$79=$I$1,ROW($A$1:$A$79)),ROW(89:89)),5))","v":""},{"$f":"IF(ISERROR(INDEX($A$1:$G$79,SMALL(IF($A$1:$A$79=$I$1,ROW($A$1:$A$79)),ROW(89:89)),6)),\"\",INDEX($A$1:$G$79,SMALL(IF($A$1:$A$79=$I$1,ROW($A$1:$A$79)),ROW(89:89)),6))","v":""},{"$f":"IF(ISERROR(INDEX($A$1:$H$79,SMALL(IF($A$1:$A$79=$I$1,ROW($A$1:$A$79)),ROW(89:89)),8)),\"\",INDEX($A$1:$H$79,SMALL(IF($A$1:$A$79=$I$1,ROW($A$1:$A$79)),ROW(89:89)),8))","v":""},{"$f":"IF(ISERROR(INDEX($A$1:$G$79,SMALL(IF($B$1:$B$79=$N$1,ROW($B$1:$B$79)),ROW(89:89)),6)),\"\",INDEX($A$1:$G$79,SMALL(IF($B$1:$B$79=$N$1,ROW($B$1:$B$79)),ROW(89:89)),6))","v":""},{"$f":"IF(ISERROR(INDEX($A$1:$G$79,SMALL(IF($B$1:$B$79=$N$1,ROW($B$1:$B$79)),ROW(89:89)),4)),\"\",INDEX($A$1:$G$79,SMALL(IF($B$1:$B$79=$N$1,ROW($B$1:$B$79)),ROW(89:89)),4))","v":""},{"$f":"IF(ISERROR(INDEX($A$1:$G$79,SMALL(IF($B$1:$B$79=$N$1,ROW($B$1:$B$79)),ROW(89:89)),5)),\"\",INDEX($A$1:$G$79,SMALL(IF($B$1:$B$79=$N$1,ROW($B$1:$B$79)),ROW(89:89)),5))","v":""},{"$f":"IF(ISERROR(INDEX($A$1:$G$79,SMALL(IF($B$1:$B$79=$N$1,ROW($B$1:$B$79)),ROW(89:89)),7)),\"\",INDEX($A$1:$G$79,SMALL(IF($B$1:$B$79=$N$1,ROW($B$1:$B$79)),ROW(89:89)),7))","v":""},{"$f":"IF(ISERROR(INDEX($A$1:$H$79,SMALL(IF($B$1:$B$79=$N$1,ROW($B$1:$B$79)),ROW(89:89)),8)),\"\",INDEX($A$1:$H$79,SMALL(IF($B$1:$B$79=$N$1,ROW($B$1:$B$79)),ROW(89:89)),8))","v":""},{"$f":"IF(ISERROR(INDEX($A$1:$G$79,SMALL(IF($C$1:$C$79=$S$1,ROW($C$1:$C$79)),ROW(89:89)),6)),\"\",INDEX($A$1:$G$79,SMALL(IF($C$1:$C$79=$S$1,ROW($C$1:$C$79)),ROW(89:89)),6))","v":""},{"$f":"IF(ISERROR(INDEX($A$1:$G$79,SMALL(IF($C$1:$C$79=$S$1,ROW($C$1:$C$79)),ROW(89:89)),4)),\"\",INDEX($A$1:$G$79,SMALL(IF($C$1:$C$79=$S$1,ROW($C$1:$C$79)),ROW(89:89)),4))","v":""},{"$f":"IF(ISERROR(INDEX($A$1:$G$79,SMALL(IF($C$1:$C$79=$S$1,ROW($C$1:$C$79)),ROW(89:89)),5)),\"\",INDEX($A$1:$G$79,SMALL(IF($C$1:$C$79=$S$1,ROW($C$1:$C$79)),ROW(89:89)),5))","v":""},{"$f":"IF(ISERROR(INDEX($A$1:$G$79,SMALL(IF($C$1:$C$79=$S$1,ROW($C$1:$C$79)),ROW(89:89)),7)),\"\",INDEX($A$1:$G$79,SMALL(IF($C$1:$C$79=$S$1,ROW($C$1:$C$79)),ROW(89:89)),7))","v":""},{"$f":"IF(ISERROR(INDEX($A$1:$H$79,SMALL(IF($C$1:$C$79=$S$1,ROW($C$1:$C$79)),ROW(89:89)),8)),\"\",INDEX($A$1:$H$79,SMALL(IF($C$1:$C$79=$S$1,ROW($C$1:$C$79)),ROW(89:89)),8))","v":""}," "]
[null,null,null,null,null,null,null,null,{"$f":"IF(ISERROR(INDEX($A$1:$G$79,SMALL(IF($A$1:$A$79=$I$1,ROW($A$1:$A$79)),ROW(90:90)),7)),\"\",INDEX($A$1:$G$79,SMALL(IF($A$1:$A$79=$I$1,ROW($A$1:$A$79)),ROW(90:90)),7))","v":""},{"$f":"IF(ISERROR(INDEX($A$1:$G$79,SMALL(IF($A$1:$A$79=$I$1,ROW($A$1:$A$79)),ROW(90:90)),4)),\"\",INDEX($A$1:$G$79,SMALL(IF($A$1:$A$79=$I$1,ROW($A$1:$A$79)),ROW(90:90)),4))","v":""},{"$f":"IF(ISERROR(INDEX($A$1:$G$79,SMALL(IF($A$1:$A$79=$I$1,ROW($A$1:$A$79)),ROW(90:90)),5)),\"\",INDEX($A$1:$G$79,SMALL(IF($A$1:$A$79=$I$1,ROW($A$1:$A$79)),ROW(90:90)),5))","v":""},{"$f":"IF(ISERROR(INDEX($A$1:$G$79,SMALL(IF($A$1:$A$79=$I$1,ROW($A$1:$A$79)),ROW(90:90)),6)),\"\",INDEX($A$1:$G$79,SMALL(IF($A$1:$A$79=$I$1,ROW($A$1:$A$79)),ROW(90:90)),6))","v":""},{"$f":"IF(ISERROR(INDEX($A$1:$H$79,SMALL(IF($A$1:$A$79=$I$1,ROW($A$1:$A$79)),ROW(90:90)),8)),\"\",INDEX($A$1:$H$79,SMALL(IF($A$1:$A$79=$I$1,ROW($A$1:$A$79)),ROW(90:90)),8))","v":""},{"$f":"IF(ISERROR(INDEX($A$1:$G$79,SMALL(IF($B$1:$B$79=$N$1,ROW($B$1:$B$79)),ROW(90:90)),6)),\"\",INDEX($A$1:$G$79,SMALL(IF($B$1:$B$79=$N$1,ROW($B$1:$B$79)),ROW(90:90)),6))","v":""},{"$f":"IF(ISERROR(INDEX($A$1:$G$79,SMALL(IF($B$1:$B$79=$N$1,ROW($B$1:$B$79)),ROW(90:90)),4)),\"\",INDEX($A$1:$G$79,SMALL(IF($B$1:$B$79=$N$1,ROW($B$1:$B$79)),ROW(90:90)),4))","v":""},{"$f":"IF(ISERROR(INDEX($A$1:$G$79,SMALL(IF($B$1:$B$79=$N$1,ROW($B$1:$B$79)),ROW(90:90)),5)),\"\",INDEX($A$1:$G$79,SMALL(IF($B$1:$B$79=$N$1,ROW($B$1:$B$79)),ROW(90:90)),5))","v":""},{"$f":"IF(ISERROR(INDEX($A$1:$G$79,SMALL(IF($B$1:$B$79=$N$1,ROW($B$1:$B$79)),ROW(90:90)),7)),\"\",INDEX($A$1:$G$79,SMALL(IF($B$1:$B$79=$N$1,ROW($B$1:$B$79)),ROW(90:90)),7))","v":""},{"$f":"IF(ISERROR(INDEX($A$1:$H$79,SMALL(IF($B$1:$B$79=$N$1,ROW($B$1:$B$79)),ROW(90:90)),8)),\"\",INDEX($A$1:$H$79,SMALL(IF($B$1:$B$79=$N$1,ROW($B$1:$B$79)),ROW(90:90)),8))","v":""},{"$f":"IF(ISERROR(INDEX($A$1:$G$79,SMALL(IF($C$1:$C$79=$S$1,ROW($C$1:$C$79)),ROW(90:90)),6)),\"\",INDEX($A$1:$G$79,SMALL(IF($C$1:$C$79=$S$1,ROW($C$1:$C$79)),ROW(90:90)),6))","v":""},{"$f":"IF(ISERROR(INDEX($A$1:$G$79,SMALL(IF($C$1:$C$79=$S$1,ROW($C$1:$C$79)),ROW(90:90)),4)),\"\",INDEX($A$1:$G$79,SMALL(IF($C$1:$C$79=$S$1,ROW($C$1:$C$79)),ROW(90:90)),4))","v":""},{"$f":"IF(ISERROR(INDEX($A$1:$G$79,SMALL(IF($C$1:$C$79=$S$1,ROW($C$1:$C$79)),ROW(90:90)),5)),\"\",INDEX($A$1:$G$79,SMALL(IF($C$1:$C$79=$S$1,ROW($C$1:$C$79)),ROW(90:90)),5))","v":""},{"$f":"IF(ISERROR(INDEX($A$1:$G$79,SMALL(IF($C$1:$C$79=$S$1,ROW($C$1:$C$79)),ROW(90:90)),7)),\"\",INDEX($A$1:$G$79,SMALL(IF($C$1:$C$79=$S$1,ROW($C$1:$C$79)),ROW(90:90)),7))","v":""},{"$f":"IF(ISERROR(INDEX($A$1:$H$79,SMALL(IF($C$1:$C$79=$S$1,ROW($C$1:$C$79)),ROW(90:90)),8)),\"\",INDEX($A$1:$H$79,SMALL(IF($C$1:$C$79=$S$1,ROW($C$1:$C$79)),ROW(90:90)),8))","v":""}," "]
[null,null,null,null,null,null,null,null,{"$f":"IF(ISERROR(INDEX($A$1:$G$79,SMALL(IF($A$1:$A$79=$I$1,ROW($A$1:$A$79)),ROW(91:91)),7)),\"\",INDEX($A$1:$G$79,SMALL(IF($A$1:$A$79=$I$1,ROW($A$1:$A$79)),ROW(91:91)),7))","v":""},{"$f":"IF(ISERROR(INDEX($A$1:$G$79,SMALL(IF($A$1:$A$79=$I$1,ROW($A$1:$A$79)),ROW(91:91)),4)),\"\",INDEX($A$1:$G$79,SMALL(IF($A$1:$A$79=$I$1,ROW($A$1:$A$79)),ROW(91:91)),4))","v":""},{"$f":"IF(ISERROR(INDEX($A$1:$G$79,SMALL(IF($A$1:$A$79=$I$1,ROW($A$1:$A$79)),ROW(91:91)),5)),\"\",INDEX($A$1:$G$79,SMALL(IF($A$1:$A$79=$I$1,ROW($A$1:$A$79)),ROW(91:91)),5))","v":""},{"$f":"IF(ISERROR(INDEX($A$1:$G$79,SMALL(IF($A$1:$A$79=$I$1,ROW($A$1:$A$79)),ROW(91:91)),6)),\"\",INDEX($A$1:$G$79,SMALL(IF($A$1:$A$79=$I$1,ROW($A$1:$A$79)),ROW(91:91)),6))","v":""},{"$f":"IF(ISERROR(INDEX($A$1:$H$79,SMALL(IF($A$1:$A$79=$I$1,ROW($A$1:$A$79)),ROW(91:91)),8)),\"\",INDEX($A$1:$H$79,SMALL(IF($A$1:$A$79=$I$1,ROW($A$1:$A$79)),ROW(91:91)),8))","v":""},{"$f":"IF(ISERROR(INDEX($A$1:$G$79,SMALL(IF($B$1:$B$79=$N$1,ROW($B$1:$B$79)),ROW(91:91)),6)),\"\",INDEX($A$1:$G$79,SMALL(IF($B$1:$B$79=$N$1,ROW($B$1:$B$79)),ROW(91:91)),6))","v":""},{"$f":"IF(ISERROR(INDEX($A$1:$G$79,SMALL(IF($B$1:$B$79=$N$1,ROW($B$1:$B$79)),ROW(91:91)),4)),\"\",INDEX($A$1:$G$79,SMALL(IF($B$1:$B$79=$N$1,ROW($B$1:$B$79)),ROW(91:91)),4))","v":""},{"$f":"IF(ISERROR(INDEX($A$1:$G$79,SMALL(IF($B$1:$B$79=$N$1,ROW($B$1:$B$79)),ROW(91:91)),5)),\"\",INDEX($A$1:$G$79,SMALL(IF($B$1:$B$79=$N$1,ROW($B$1:$B$79)),ROW(91:91)),5))","v":""},{"$f":"IF(ISERROR(INDEX($A$1:$G$79,SMALL(IF($B$1:$B$79=$N$1,ROW($B$1:$B$79)),ROW(91:91)),7)),\"\",INDEX($A$1:$G$79,SMALL(IF($B$1:$B$79=$N$1,ROW($B$1:$B$79)),ROW(91:91)),7))","v":""},{"$f":"IF(ISERROR(INDEX($A$1:$H$79,SMALL(IF($B$1:$B$79=$N$1,ROW($B$1:$B$79)),ROW(91:91)),8)),\"\",INDEX($A$1:$H$79,SMALL(IF($B$1:$B$79=$N$1,ROW($B$1:$B$79)),ROW(91:91)),8))","v":""},{"$f":"IF(ISERROR(INDEX($A$1:$G$79,SMALL(IF($C$1:$C$79=$S$1,ROW($C$1:$C$79)),ROW(91:91)),6)),\"\",INDEX($A$1:$G$79,SMALL(IF($C$1:$C$79=$S$1,ROW($C$1:$C$79)),ROW(91:91)),6))","v":""},{"$f":"IF(ISERROR(INDEX($A$1:$G$79,SMALL(IF($C$1:$C$79=$S$1,ROW($C$1:$C$79)),ROW(91:91)),4)),\"\",INDEX($A$1:$G$79,SMALL(IF($C$1:$C$79=$S$1,ROW($C$1:$C$79)),ROW(91:91)),4))","v":""},{"$f":"IF(ISERROR(INDEX($A$1:$G$79,SMALL(IF($C$1:$C$79=$S$1,ROW($C$1:$C$79)),ROW(91:91)),5)),\"\",INDEX($A$1:$G$79,SMALL(IF($C$1:$C$79=$S$1,ROW($C$1:$C$79)),ROW(91:91)),5))","v":""},{"$f":"IF(ISERROR(INDEX($A$1:$G$79,SMALL(IF($C$1:$C$79=$S$1,ROW($C$1:$C$79)),ROW(91:91)),7)),\"\",INDEX($A$1:$G$79,SMALL(IF($C$1:$C$79=$S$1,ROW($C$1:$C$79)),ROW(91:91)),7))","v":""},{"$f":"IF(ISERROR(INDEX($A$1:$H$79,SMALL(IF($C$1:$C$79=$S$1,ROW($C$1:$C$79)),ROW(91:91)),8)),\"\",INDEX($A$1:$H$79,SMALL(IF($C$1:$C$79=$S$1,ROW($C$1:$C$79)),ROW(91:91)),8))","v":""}," "]
[null,null,null,null,null,null,null,null,{"$f":"IF(ISERROR(INDEX($A$1:$G$79,SMALL(IF($A$1:$A$79=$I$1,ROW($A$1:$A$79)),ROW(92:92)),7)),\"\",INDEX($A$1:$G$79,SMALL(IF($A$1:$A$79=$I$1,ROW($A$1:$A$79)),ROW(92:92)),7))","v":""},{"$f":"IF(ISERROR(INDEX($A$1:$G$79,SMALL(IF($A$1:$A$79=$I$1,ROW($A$1:$A$79)),ROW(92:92)),4)),\"\",INDEX($A$1:$G$79,SMALL(IF($A$1:$A$79=$I$1,ROW($A$1:$A$79)),ROW(92:92)),4))","v":""},{"$f":"IF(ISERROR(INDEX($A$1:$G$79,SMALL(IF($A$1:$A$79=$I$1,ROW($A$1:$A$79)),ROW(92:92)),5)),\"\",INDEX($A$1:$G$79,SMALL(IF($A$1:$A$79=$I$1,ROW($A$1:$A$79)),ROW(92:92)),5))","v":""},{"$f":"IF(ISERROR(INDEX($A$1:$G$79,SMALL(IF($A$1:$A$79=$I$1,ROW($A$1:$A$79)),ROW(92:92)),6)),\"\",INDEX($A$1:$G$79,SMALL(IF($A$1:$A$79=$I$1,ROW($A$1:$A$79)),ROW(92:92)),6))","v":""},{"$f":"IF(ISERROR(INDEX($A$1:$H$79,SMALL(IF($A$1:$A$79=$I$1,ROW($A$1:$A$79)),ROW(92:92)),8)),\"\",INDEX($A$1:$H$79,SMALL(IF($A$1:$A$79=$I$1,ROW($A$1:$A$79)),ROW(92:92)),8))","v":""},{"$f":"IF(ISERROR(INDEX($A$1:$G$79,SMALL(IF($B$1:$B$79=$N$1,ROW($B$1:$B$79)),ROW(92:92)),6)),\"\",INDEX($A$1:$G$79,SMALL(IF($B$1:$B$79=$N$1,ROW($B$1:$B$79)),ROW(92:92)),6))","v":""},{"$f":"IF(ISERROR(INDEX($A$1:$G$79,SMALL(IF($B$1:$B$79=$N$1,ROW($B$1:$B$79)),ROW(92:92)),4)),\"\",INDEX($A$1:$G$79,SMALL(IF($B$1:$B$79=$N$1,ROW($B$1:$B$79)),ROW(92:92)),4))","v":""},{"$f":"IF(ISERROR(INDEX($A$1:$G$79,SMALL(IF($B$1:$B$79=$N$1,ROW($B$1:$B$79)),ROW(92:92)),5)),\"\",INDEX($A$1:$G$79,SMALL(IF($B$1:$B$79=$N$1,ROW($B$1:$B$79)),ROW(92:92)),5))","v":""},{"$f":"IF(ISERROR(INDEX($A$1:$G$79,SMALL(IF($B$1:$B$79=$N$1,ROW($B$1:$B$79)),ROW(92:92)),7)),\"\",INDEX($A$1:$G$79,SMALL(IF($B$1:$B$79=$N$1,ROW($B$1:$B$79)),ROW(92:92)),7))","v":""},{"$f":"IF(ISERROR(INDEX($A$1:$H$79,SMALL(IF($B$1:$B$79=$N$1,ROW($B$1:$B$79)),ROW(92:92)),8)),\"\",INDEX($A$1:$H$79,SMALL(IF($B$1:$B$79=$N$1,ROW($B$1:$B$79)),ROW(92:92)),8))","v":""},{"$f":"IF(ISERROR(INDEX($A$1:$G$79,SMALL(IF($C$1:$C$79=$S$1,ROW($C$1:$C$79)),ROW(92:92)),6)),\"\",INDEX($A$1:$G$79,SMALL(IF($C$1:$C$79=$S$1,ROW($C$1:$C$79)),ROW(92:92)),6))","v":""},{"$f":"IF(ISERROR(INDEX($A$1:$G$79,SMALL(IF($C$1:$C$79=$S$1,ROW($C$1:$C$79)),ROW(92:92)),4)),\"\",INDEX($A$1:$G$79,SMALL(IF($C$1:$C$79=$S$1,ROW($C$1:$C$79)),ROW(92:92)),4))","v":""},{"$f":"IF(ISERROR(INDEX($A$1:$G$79,SMALL(IF($C$1:$C$79=$S$1,ROW($C$1:$C$79)),ROW(92:92)),5)),\"\",INDEX($A$1:$G$79,SMALL(IF($C$1:$C$79=$S$1,ROW($C$1:$C$79)),ROW(92:92)),5))","v":""},{"$f":"IF(ISERROR(INDEX($A$1:$G$79,SMALL(IF($C$1:$C$79=$S$1,ROW($C$1:$C$79)),ROW(92:92)),7)),\"\",INDEX($A$1:$G$79,SMALL(IF($C$1:$C$79=$S$1,ROW($C$1:$C$79)),ROW(92:92)),7))","v":""},{"$f":"IF(ISERROR(INDEX($A$1:$H$79,SMALL(IF($C$1:$C$79=$S$1,ROW($C$1:$C$79)),ROW(92:92)),8)),\"\",INDEX($A$1:$H$79,SMALL(IF($C$1:$C$79=$S$1,ROW($C$1:$C$79)),ROW(92:92)),8))","v":""}," "]
[null,null,null,null,null,null,null,null,{"$f":"IF(ISERROR(INDEX($A$1:$G$79,SMALL(IF($A$1:$A$79=$I$1,ROW($A$1:$A$79)),ROW(93:93)),7)),\"\",INDEX($A$1:$G$79,SMALL(IF($A$1:$A$79=$I$1,ROW($A$1:$A$79)),ROW(93:93)),7))","v":""},{"$f":"IF(ISERROR(INDEX($A$1:$G$79,SMALL(IF($A$1:$A$79=$I$1,ROW($A$1:$A$79)),ROW(93:93)),4)),\"\",INDEX($A$1:$G$79,SMALL(IF($A$1:$A$79=$I$1,ROW($A$1:$A$79)),ROW(93:93)),4))","v":""},{"$f":"IF(ISERROR(INDEX($A$1:$G$79,SMALL(IF($A$1:$A$79=$I$1,ROW($A$1:$A$79)),ROW(93:93)),5)),\"\",INDEX($A$1:$G$79,SMALL(IF($A$1:$A$79=$I$1,ROW($A$1:$A$79)),ROW(93:93)),5))","v":""},{"$f":"IF(ISERROR(INDEX($A$1:$G$79,SMALL(IF($A$1:$A$79=$I$1,ROW($A$1:$A$79)),ROW(93:93)),6)),\"\",INDEX($A$1:$G$79,SMALL(IF($A$1:$A$79=$I$1,ROW($A$1:$A$79)),ROW(93:93)),6))","v":""},{"$f":"IF(ISERROR(INDEX($A$1:$H$79,SMALL(IF($A$1:$A$79=$I$1,ROW($A$1:$A$79)),ROW(93:93)),8)),\"\",INDEX($A$1:$H$79,SMALL(IF($A$1:$A$79=$I$1,ROW($A$1:$A$79)),ROW(93:93)),8))","v":""},{"$f":"IF(ISERROR(INDEX($A$1:$G$79,SMALL(IF($B$1:$B$79=$N$1,ROW($B$1:$B$79)),ROW(93:93)),6)),\"\",INDEX($A$1:$G$79,SMALL(IF($B$1:$B$79=$N$1,ROW($B$1:$B$79)),ROW(93:93)),6))","v":""},{"$f":"IF(ISERROR(INDEX($A$1:$G$79,SMALL(IF($B$1:$B$79=$N$1,ROW($B$1:$B$79)),ROW(93:93)),4)),\"\",INDEX($A$1:$G$79,SMALL(IF($B$1:$B$79=$N$1,ROW($B$1:$B$79)),ROW(93:93)),4))","v":""},{"$f":"IF(ISERROR(INDEX($A$1:$G$79,SMALL(IF($B$1:$B$79=$N$1,ROW($B$1:$B$79)),ROW(93:93)),5)),\"\",INDEX($A$1:$G$79,SMALL(IF($B$1:$B$79=$N$1,ROW($B$1:$B$79)),ROW(93:93)),5))","v":""},{"$f":"IF(ISERROR(INDEX($A$1:$G$79,SMALL(IF($B$1:$B$79=$N$1,ROW($B$1:$B$79)),ROW(93:93)),7)),\"\",INDEX($A$1:$G$79,SMALL(IF($B$1:$B$79=$N$1,ROW($B$1:$B$79)),ROW(93:93)),7))","v":""},{"$f":"IF(ISERROR(INDEX($A$1:$H$79,SMALL(IF($B$1:$B$79=$N$1,ROW($B$1:$B$79)),ROW(93:93)),8)),\"\",INDEX($A$1:$H$79,SMALL(IF($B$1:$B$79=$N$1,ROW($B$1:$B$79)),ROW(93:93)),8))","v":""},{"$f":"IF(ISERROR(INDEX($A$1:$G$79,SMALL(IF($C$1:$C$79=$S$1,ROW($C$1:$C$79)),ROW(93:93)),6)),\"\",INDEX($A$1:$G$79,SMALL(IF($C$1:$C$79=$S$1,ROW($C$1:$C$79)),ROW(93:93)),6))","v":""},{"$f":"IF(ISERROR(INDEX($A$1:$G$79,SMALL(IF($C$1:$C$79=$S$1,ROW($C$1:$C$79)),ROW(93:93)),4)),\"\",INDEX($A$1:$G$79,SMALL(IF($C$1:$C$79=$S$1,ROW($C$1:$C$79)),ROW(93:93)),4))","v":""},{"$f":"IF(ISERROR(INDEX($A$1:$G$79,SMALL(IF($C$1:$C$79=$S$1,ROW($C$1:$C$79)),ROW(93:93)),5)),\"\",INDEX($A$1:$G$79,SMALL(IF($C$1:$C$79=$S$1,ROW($C$1:$C$79)),ROW(93:93)),5))","v":""},{"$f":"IF(ISERROR(INDEX($A$1:$G$79,SMALL(IF($C$1:$C$79=$S$1,ROW($C$1:$C$79)),ROW(93:93)),7)),\"\",INDEX($A$1:$G$79,SMALL(IF($C$1:$C$79=$S$1,ROW($C$1:$C$79)),ROW(93:93)),7))","v":""},{"$f":"IF(ISERROR(INDEX($A$1:$H$79,SMALL(IF($C$1:$C$79=$S$1,ROW($C$1:$C$79)),ROW(93:93)),8)),\"\",INDEX($A$1:$H$79,SMALL(IF($C$1:$C$79=$S$1,ROW($C$1:$C$79)),ROW(93:93)),8))","v":""}," "]
[null,null,null,null,null,null,null,null,{"$f":"IF(ISERROR(INDEX($A$1:$G$79,SMALL(IF($A$1:$A$79=$I$1,ROW($A$1:$A$79)),ROW(94:94)),7)),\"\",INDEX($A$1:$G$79,SMALL(IF($A$1:$A$79=$I$1,ROW($A$1:$A$79)),ROW(94:94)),7))","v":""},{"$f":"IF(ISERROR(INDEX($A$1:$G$79,SMALL(IF($A$1:$A$79=$I$1,ROW($A$1:$A$79)),ROW(94:94)),4)),\"\",INDEX($A$1:$G$79,SMALL(IF($A$1:$A$79=$I$1,ROW($A$1:$A$79)),ROW(94:94)),4))","v":""},{"$f":"IF(ISERROR(INDEX($A$1:$G$79,SMALL(IF($A$1:$A$79=$I$1,ROW($A$1:$A$79)),ROW(94:94)),5)),\"\",INDEX($A$1:$G$79,SMALL(IF($A$1:$A$79=$I$1,ROW($A$1:$A$79)),ROW(94:94)),5))","v":""},{"$f":"IF(ISERROR(INDEX($A$1:$G$79,SMALL(IF($A$1:$A$79=$I$1,ROW($A$1:$A$79)),ROW(94:94)),6)),\"\",INDEX($A$1:$G$79,SMALL(IF($A$1:$A$79=$I$1,ROW($A$1:$A$79)),ROW(94:94)),6))","v":""},{"$f":"IF(ISERROR(INDEX($A$1:$H$79,SMALL(IF($A$1:$A$79=$I$1,ROW($A$1:$A$79)),ROW(94:94)),8)),\"\",INDEX($A$1:$H$79,SMALL(IF($A$1:$A$79=$I$1,ROW($A$1:$A$79)),ROW(94:94)),8))","v":""},{"$f":"IF(ISERROR(INDEX($A$1:$G$79,SMALL(IF($B$1:$B$79=$N$1,ROW($B$1:$B$79)),ROW(94:94)),6)),\"\",INDEX($A$1:$G$79,SMALL(IF($B$1:$B$79=$N$1,ROW($B$1:$B$79)),ROW(94:94)),6))","v":""},{"$f":"IF(ISERROR(INDEX($A$1:$G$79,SMALL(IF($B$1:$B$79=$N$1,ROW($B$1:$B$79)),ROW(94:94)),4)),\"\",INDEX($A$1:$G$79,SMALL(IF($B$1:$B$79=$N$1,ROW($B$1:$B$79)),ROW(94:94)),4))","v":""},{"$f":"IF(ISERROR(INDEX($A$1:$G$79,SMALL(IF($B$1:$B$79=$N$1,ROW($B$1:$B$79)),ROW(94:94)),5)),\"\",INDEX($A$1:$G$79,SMALL(IF($B$1:$B$79=$N$1,ROW($B$1:$B$79)),ROW(94:94)),5))","v":""},{"$f":"IF(ISERROR(INDEX($A$1:$G$79,SMALL(IF($B$1:$B$79=$N$1,ROW($B$1:$B$79)),ROW(94:94)),7)),\"\",INDEX($A$1:$G$79,SMALL(IF($B$1:$B$79=$N$1,ROW($B$1:$B$79)),ROW(94:94)),7))","v":""},{"$f":"IF(ISERROR(INDEX($A$1:$H$79,SMALL(IF($B$1:$B$79=$N$1,ROW($B$1:$B$79)),ROW(94:94)),8)),\"\",INDEX($A$1:$H$79,SMALL(IF($B$1:$B$79=$N$1,ROW($B$1:$B$79)),ROW(94:94)),8))","v":""},{"$f":"IF(ISERROR(INDEX($A$1:$G$79,SMALL(IF($C$1:$C$79=$S$1,ROW($C$1:$C$79)),ROW(94:94)),6)),\"\",INDEX($A$1:$G$79,SMALL(IF($C$1:$C$79=$S$1,ROW($C$1:$C$79)),ROW(94:94)),6))","v":""},{"$f":"IF(ISERROR(INDEX($A$1:$G$79,SMALL(IF($C$1:$C$79=$S$1,ROW($C$1:$C$79)),ROW(94:94)),4)),\"\",INDEX($A$1:$G$79,SMALL(IF($C$1:$C$79=$S$1,ROW($C$1:$C$79)),ROW(94:94)),4))","v":""},{"$f":"IF(ISERROR(INDEX($A$1:$G$79,SMALL(IF($C$1:$C$79=$S$1,ROW($C$1:$C$79)),ROW(94:94)),5)),\"\",INDEX($A$1:$G$79,SMALL(IF($C$1:$C$79=$S$1,ROW($C$1:$C$79)),ROW(94:94)),5))","v":""},{"$f":"IF(ISERROR(INDEX($A$1:$G$79,SMALL(IF($C$1:$C$79=$S$1,ROW($C$1:$C$79)),ROW(94:94)),7)),\"\",INDEX($A$1:$G$79,SMALL(IF($C$1:$C$79=$S$1,ROW($C$1:$C$79)),ROW(94:94)),7))","v":""},{"$f":"IF(ISERROR(INDEX($A$1:$H$79,SMALL(IF($C$1:$C$79=$S$1,ROW($C$1:$C$79)),ROW(94:94)),8)),\"\",INDEX($A$1:$H$79,SMALL(IF($C$1:$C$79=$S$1,ROW($C$1:$C$79)),ROW(94:94)),8))","v":""}," "]
[null,null,null,null,null,null,null,null,{"$f":"IF(ISERROR(INDEX($A$1:$G$79,SMALL(IF($A$1:$A$79=$I$1,ROW($A$1:$A$79)),ROW(95:95)),7)),\"\",INDEX($A$1:$G$79,SMALL(IF($A$1:$A$79=$I$1,ROW($A$1:$A$79)),ROW(95:95)),7))","v":""},{"$f":"IF(ISERROR(INDEX($A$1:$G$79,SMALL(IF($A$1:$A$79=$I$1,ROW($A$1:$A$79)),ROW(95:95)),4)),\"\",INDEX($A$1:$G$79,SMALL(IF($A$1:$A$79=$I$1,ROW($A$1:$A$79)),ROW(95:95)),4))","v":""},{"$f":"IF(ISERROR(INDEX($A$1:$G$79,SMALL(IF($A$1:$A$79=$I$1,ROW($A$1:$A$79)),ROW(95:95)),5)),\"\",INDEX($A$1:$G$79,SMALL(IF($A$1:$A$79=$I$1,ROW($A$1:$A$79)),ROW(95:95)),5))","v":""},{"$f":"IF(ISERROR(INDEX($A$1:$G$79,SMALL(IF($A$1:$A$79=$I$1,ROW($A$1:$A$79)),ROW(95:95)),6)),\"\",INDEX($A$1:$G$79,SMALL(IF($A$1:$A$79=$I$1,ROW($A$1:$A$79)),ROW(95:95)),6))","v":""},{"$f":"IF(ISERROR(INDEX($A$1:$H$79,SMALL(IF($A$1:$A$79=$I$1,ROW($A$1:$A$79)),ROW(95:95)),8)),\"\",INDEX($A$1:$H$79,SMALL(IF($A$1:$A$79=$I$1,ROW($A$1:$A$79)),ROW(95:95)),8))","v":""},{"$f":"IF(ISERROR(INDEX($A$1:$G$79,SMALL(IF($B$1:$B$79=$N$1,ROW($B$1:$B$79)),ROW(95:95)),6)),\"\",INDEX($A$1:$G$79,SMALL(IF($B$1:$B$79=$N$1,ROW($B$1:$B$79)),ROW(95:95)),6))","v":""},{"$f":"IF(ISERROR(INDEX($A$1:$G$79,SMALL(IF($B$1:$B$79=$N$1,ROW($B$1:$B$79)),ROW(95:95)),4)),\"\",INDEX($A$1:$G$79,SMALL(IF($B$1:$B$79=$N$1,ROW($B$1:$B$79)),ROW(95:95)),4))","v":""},{"$f":"IF(ISERROR(INDEX($A$1:$G$79,SMALL(IF($B$1:$B$79=$N$1,ROW($B$1:$B$79)),ROW(95:95)),5)),\"\",INDEX($A$1:$G$79,SMALL(IF($B$1:$B$79=$N$1,ROW($B$1:$B$79)),ROW(95:95)),5))","v":""},{"$f":"IF(ISERROR(INDEX($A$1:$G$79,SMALL(IF($B$1:$B$79=$N$1,ROW($B$1:$B$79)),ROW(95:95)),7)),\"\",INDEX($A$1:$G$79,SMALL(IF($B$1:$B$79=$N$1,ROW($B$1:$B$79)),ROW(95:95)),7))","v":""},{"$f":"IF(ISERROR(INDEX($A$1:$H$79,SMALL(IF($B$1:$B$79=$N$1,ROW($B$1:$B$79)),ROW(95:95)),8)),\"\",INDEX($A$1:$H$79,SMALL(IF($B$1:$B$79=$N$1,ROW($B$1:$B$79)),ROW(95:95)),8))","v":""},{"$f":"IF(ISERROR(INDEX($A$1:$G$79,SMALL(IF($C$1:$C$79=$S$1,ROW($C$1:$C$79)),ROW(95:95)),6)),\"\",INDEX($A$1:$G$79,SMALL(IF($C$1:$C$79=$S$1,ROW($C$1:$C$79)),ROW(95:95)),6))","v":""},{"$f":"IF(ISERROR(INDEX($A$1:$G$79,SMALL(IF($C$1:$C$79=$S$1,ROW($C$1:$C$79)),ROW(95:95)),4)),\"\",INDEX($A$1:$G$79,SMALL(IF($C$1:$C$79=$S$1,ROW($C$1:$C$79)),ROW(95:95)),4))","v":""},{"$f":"IF(ISERROR(INDEX($A$1:$G$79,SMALL(IF($C$1:$C$79=$S$1,ROW($C$1:$C$79)),ROW(95:95)),5)),\"\",INDEX($A$1:$G$79,SMALL(IF($C$1:$C$79=$S$1,ROW($C$1:$C$79)),ROW(95:95)),5))","v":""},{"$f":"IF(ISERROR(INDEX($A$1:$G$79,SMALL(IF($C$1:$C$79=$S$1,ROW($C$1:$C$79)),ROW(95:95)),7)),\"\",INDEX($A$1:$G$79,SMALL(IF($C$1:$C$79=$S$1,ROW($C$1:$C$79)),ROW(95:95)),7))","v":""},{"$f":"IF(ISERROR(INDEX($A$1:$H$79,SMALL(IF($C$1:$C$79=$S$1,ROW($C$1:$C$79)),ROW(95:95)),8)),\"\",INDEX($A$1:$H$79,SMALL(IF($C$1:$C$79=$S$1,ROW($C$1:$C$79)),ROW(95:95)),8))","v":""}," "]
[null,null,null,null,null,null,null,null,{"$f":"IF(ISERROR(INDEX($A$1:$G$79,SMALL(IF($A$1:$A$79=$I$1,ROW($A$1:$A$79)),ROW(96:96)),7)),\"\",INDEX($A$1:$G$79,SMALL(IF($A$1:$A$79=$I$1,ROW($A$1:$A$79)),ROW(96:96)),7))","v":""},{"$f":"IF(ISERROR(INDEX($A$1:$G$79,SMALL(IF($A$1:$A$79=$I$1,ROW($A$1:$A$79)),ROW(96:96)),4)),\"\",INDEX($A$1:$G$79,SMALL(IF($A$1:$A$79=$I$1,ROW($A$1:$A$79)),ROW(96:96)),4))","v":""},{"$f":"IF(ISERROR(INDEX($A$1:$G$79,SMALL(IF($A$1:$A$79=$I$1,ROW($A$1:$A$79)),ROW(96:96)),5)),\"\",INDEX($A$1:$G$79,SMALL(IF($A$1:$A$79=$I$1,ROW($A$1:$A$79)),ROW(96:96)),5))","v":""},{"$f":"IF(ISERROR(INDEX($A$1:$G$79,SMALL(IF($A$1:$A$79=$I$1,ROW($A$1:$A$79)),ROW(96:96)),6)),\"\",INDEX($A$1:$G$79,SMALL(IF($A$1:$A$79=$I$1,ROW($A$1:$A$79)),ROW(96:96)),6))","v":""},{"$f":"IF(ISERROR(INDEX($A$1:$H$79,SMALL(IF($A$1:$A$79=$I$1,ROW($A$1:$A$79)),ROW(96:96)),8)),\"\",INDEX($A$1:$H$79,SMALL(IF($A$1:$A$79=$I$1,ROW($A$1:$A$79)),ROW(96:96)),8))","v":""},{"$f":"IF(ISERROR(INDEX($A$1:$G$79,SMALL(IF($B$1:$B$79=$N$1,ROW($B$1:$B$79)),ROW(96:96)),6)),\"\",INDEX($A$1:$G$79,SMALL(IF($B$1:$B$79=$N$1,ROW($B$1:$B$79)),ROW(96:96)),6))","v":""},{"$f":"IF(ISERROR(INDEX($A$1:$G$79,SMALL(IF($B$1:$B$79=$N$1,ROW($B$1:$B$79)),ROW(96:96)),4)),\"\",INDEX($A$1:$G$79,SMALL(IF($B$1:$B$79=$N$1,ROW($B$1:$B$79)),ROW(96:96)),4))","v":""},{"$f":"IF(ISERROR(INDEX($A$1:$G$79,SMALL(IF($B$1:$B$79=$N$1,ROW($B$1:$B$79)),ROW(96:96)),5)),\"\",INDEX($A$1:$G$79,SMALL(IF($B$1:$B$79=$N$1,ROW($B$1:$B$79)),ROW(96:96)),5))","v":""},{"$f":"IF(ISERROR(INDEX($A$1:$G$79,SMALL(IF($B$1:$B$79=$N$1,ROW($B$1:$B$79)),ROW(96:96)),7)),\"\",INDEX($A$1:$G$79,SMALL(IF($B$1:$B$79=$N$1,ROW($B$1:$B$79)),ROW(96:96)),7))","v":""},{"$f":"IF(ISERROR(INDEX($A$1:$H$79,SMALL(IF($B$1:$B$79=$N$1,ROW($B$1:$B$79)),ROW(96:96)),8)),\"\",INDEX($A$1:$H$79,SMALL(IF($B$1:$B$79=$N$1,ROW($B$1:$B$79)),ROW(96:96)),8))","v":""},{"$f":"IF(ISERROR(INDEX($A$1:$G$79,SMALL(IF($C$1:$C$79=$S$1,ROW($C$1:$C$79)),ROW(96:96)),6)),\"\",INDEX($A$1:$G$79,SMALL(IF($C$1:$C$79=$S$1,ROW($C$1:$C$79)),ROW(96:96)),6))","v":""},{"$f":"IF(ISERROR(INDEX($A$1:$G$79,SMALL(IF($C$1:$C$79=$S$1,ROW($C$1:$C$79)),ROW(96:96)),4)),\"\",INDEX($A$1:$G$79,SMALL(IF($C$1:$C$79=$S$1,ROW($C$1:$C$79)),ROW(96:96)),4))","v":""},{"$f":"IF(ISERROR(INDEX($A$1:$G$79,SMALL(IF($C$1:$C$79=$S$1,ROW($C$1:$C$79)),ROW(96:96)),5)),\"\",INDEX($A$1:$G$79,SMALL(IF($C$1:$C$79=$S$1,ROW($C$1:$C$79)),ROW(96:96)),5))","v":""},{"$f":"IF(ISERROR(INDEX($A$1:$G$79,SMALL(IF($C$1:$C$79=$S$1,ROW($C$1:$C$79)),ROW(96:96)),7)),\"\",INDEX($A$1:$G$79,SMALL(IF($C$1:$C$79=$S$1,ROW($C$1:$C$79)),ROW(96:96)),7))","v":""},{"$f":"IF(ISERROR(INDEX($A$1:$H$79,SMALL(IF($C$1:$C$79=$S$1,ROW($C$1:$C$79)),ROW(96:96)),8)),\"\",INDEX($A$1:$H$79,SMALL(IF($C$1:$C$79=$S$1,ROW($C$1:$C$79)),ROW(96:96)),8))","v":""}," "]
[null,null,null,null,null,null,null,null,{"$f":"IF(ISERROR(INDEX($A$1:$G$79,SMALL(IF($A$1:$A$79=$I$1,ROW($A$1:$A$79)),ROW(97:97)),7)),\"\",INDEX($A$1:$G$79,SMALL(IF($A$1:$A$79=$I$1,ROW($A$1:$A$79)),ROW(97:97)),7))","v":""},{"$f":"IF(ISERROR(INDEX($A$1:$G$79,SMALL(IF($A$1:$A$79=$I$1,ROW($A$1:$A$79)),ROW(97:97)),4)),\"\",INDEX($A$1:$G$79,SMALL(IF($A$1:$A$79=$I$1,ROW($A$1:$A$79)),ROW(97:97)),4))","v":""},{"$f":"IF(ISERROR(INDEX($A$1:$G$79,SMALL(IF($A$1:$A$79=$I$1,ROW($A$1:$A$79)),ROW(97:97)),5)),\"\",INDEX($A$1:$G$79,SMALL(IF($A$1:$A$79=$I$1,ROW($A$1:$A$79)),ROW(97:97)),5))","v":""},{"$f":"IF(ISERROR(INDEX($A$1:$G$79,SMALL(IF($A$1:$A$79=$I$1,ROW($A$1:$A$79)),ROW(97:97)),6)),\"\",INDEX($A$1:$G$79,SMALL(IF($A$1:$A$79=$I$1,ROW($A$1:$A$79)),ROW(97:97)),6))","v":""},{"$f":"IF(ISERROR(INDEX($A$1:$H$79,SMALL(IF($A$1:$A$79=$I$1,ROW($A$1:$A$79)),ROW(97:97)),8)),\"\",INDEX($A$1:$H$79,SMALL(IF($A$1:$A$79=$I$1,ROW($A$1:$A$79)),ROW(97:97)),8))","v":""},{"$f":"IF(ISERROR(INDEX($A$1:$G$79,SMALL(IF($B$1:$B$79=$N$1,ROW($B$1:$B$79)),ROW(97:97)),6)),\"\",INDEX($A$1:$G$79,SMALL(IF($B$1:$B$79=$N$1,ROW($B$1:$B$79)),ROW(97:97)),6))","v":""},{"$f":"IF(ISERROR(INDEX($A$1:$G$79,SMALL(IF($B$1:$B$79=$N$1,ROW($B$1:$B$79)),ROW(97:97)),4)),\"\",INDEX($A$1:$G$79,SMALL(IF($B$1:$B$79=$N$1,ROW($B$1:$B$79)),ROW(97:97)),4))","v":""},{"$f":"IF(ISERROR(INDEX($A$1:$G$79,SMALL(IF($B$1:$B$79=$N$1,ROW($B$1:$B$79)),ROW(97:97)),5)),\"\",INDEX($A$1:$G$79,SMALL(IF($B$1:$B$79=$N$1,ROW($B$1:$B$79)),ROW(97:97)),5))","v":""},{"$f":"IF(ISERROR(INDEX($A$1:$G$79,SMALL(IF($B$1:$B$79=$N$1,ROW($B$1:$B$79)),ROW(97:97)),7)),\"\",INDEX($A$1:$G$79,SMALL(IF($B$1:$B$79=$N$1,ROW($B$1:$B$79)),ROW(97:97)),7))","v":""},{"$f":"IF(ISERROR(INDEX($A$1:$H$79,SMALL(IF($B$1:$B$79=$N$1,ROW($B$1:$B$79)),ROW(97:97)),8)),\"\",INDEX($A$1:$H$79,SMALL(IF($B$1:$B$79=$N$1,ROW($B$1:$B$79)),ROW(97:97)),8))","v":""},{"$f":"IF(ISERROR(INDEX($A$1:$G$79,SMALL(IF($C$1:$C$79=$S$1,ROW($C$1:$C$79)),ROW(97:97)),6)),\"\",INDEX($A$1:$G$79,SMALL(IF($C$1:$C$79=$S$1,ROW($C$1:$C$79)),ROW(97:97)),6))","v":""},{"$f":"IF(ISERROR(INDEX($A$1:$G$79,SMALL(IF($C$1:$C$79=$S$1,ROW($C$1:$C$79)),ROW(97:97)),4)),\"\",INDEX($A$1:$G$79,SMALL(IF($C$1:$C$79=$S$1,ROW($C$1:$C$79)),ROW(97:97)),4))","v":""},{"$f":"IF(ISERROR(INDEX($A$1:$G$79,SMALL(IF($C$1:$C$79=$S$1,ROW($C$1:$C$79)),ROW(97:97)),5)),\"\",INDEX($A$1:$G$79,SMALL(IF($C$1:$C$79=$S$1,ROW($C$1:$C$79)),ROW(97:97)),5))","v":""},{"$f":"IF(ISERROR(INDEX($A$1:$G$79,SMALL(IF($C$1:$C$79=$S$1,ROW($C$1:$C$79)),ROW(97:97)),7)),\"\",INDEX($A$1:$G$79,SMALL(IF($C$1:$C$79=$S$1,ROW($C$1:$C$79)),ROW(97:97)),7))","v":""},{"$f":"IF(ISERROR(INDEX($A$1:$H$79,SMALL(IF($C$1:$C$79=$S$1,ROW($C$1:$C$79)),ROW(97:97)),8)),\"\",INDEX($A$1:$H$79,SMALL(IF($C$1:$C$79=$S$1,ROW($C$1:$C$79)),ROW(97:97)),8))","v":""}," "]

{"sheet":"Scratch - Report","index":8,"n_rows":75,"n_cols":23,"rows_kept":75,"cut":false,"hidden":true,"merged":[]}
[]
[]
[null,"This page does not comprise part of the assessment. It is for information only."]
[]
[null,"Numbers","Access",null,null,"Participant Input",null,null,"Services",null,null,"Housing",null,null,"Leases",null,null,"Project-specific",null,null,"Population"]
[null,null,"Not at all","Somewhat","Always","Not at all","Somewhat","Always","Not at all","Somewhat","Always","Not at all","Somewhat","Always","Not at all","Somewhat","Always","Not at all","Somewhat","Always","Not at all","Somewhat","Always"]
[null,"Please select answer",{"$f":"COUNTIF('Access & Input'!$F$7:$H$19,$B$7)","v":21},null,null,{"$f":"COUNTIF('Access & Input'!$F$22:$H$25,'Scratch - Report'!$B$7)","v":6},null,null,{"$f":"COUNTIF('Services & Housing'!F7:H20,$B$7)","v":21},null,null,{"$f":"COUNTIF('Services & Housing'!F22:H29,$B$7)","v":12},null,null,{"$f":"COUNTIF(Leases!F7:H20,$B$7)","v":21},null,null,{"$f":"COUNTIF('Project Specific'!F7:H22,$B$7)","v":24},null,null,{"$f":"COUNTIF('Project Specific'!F24:H31,$B$7)","v":12}]
[null,"Say it",{"$f":"COUNTIF('Access & Input'!$F$7:$F$19,C$6)","v":0},{"$f":"COUNTIF('Access & Input'!$F$7:$F$19,D$6)","v":0},{"$f":"COUNTIF('Access & Input'!$F$7:$F$19,E$6)","v":0},{"$f":"COUNTIF('Access & Input'!$F$22:$F$25,F$6)","v":0},{"$f":"COUNTIF('Access & Input'!$F$22:$F$25,G$6)","v":0},{"$f":"COUNTIF('Access & Input'!$F$22:$F$25,H$6)","v":0},{"$f":"COUNTIF('Services & Housing'!$F$7:$F$20,I$6)","v":0},{"$f":"COUNTIF('Services & Housing'!$F$7:$F$20,J$6)","v":0},{"$f":"COUNTIF('Services & Housing'!$F$7:$F$20,K$6)","v":0},{"$f":"COUNTIF('Services & Housing'!$F$22:$F$29,L$6)","v":0},{"$f":"COUNTIF('Services & Housing'!$F$22:$F$29,M$6)","v":0},{"$f":"COUNTIF('Services & Housing'!$F$22:$F$29,N$6)","v":0},{"$f":"COUNTIF(Leases!$F$7:$F$20,O$6)","v":0},{"$f":"COUNTIF(Leases!$F$7:$F$20,P$6)","v":0},{"$f":"COUNTIF(Leases!$F$7:$F$20,Q$6)","v":0},{"$f":"COUNTIF('Project Specific'!$F$7:$F$22,R$6)","v":0},{"$f":"COUNTIF('Project Specific'!$F$7:$F$22,S$6)","v":0},{"$f":"COUNTIF('Project Specific'!$F$7:$F$22,T$6)","v":0},{"$f":"COUNTIF('Project Specific'!$F$24:$F$31,U$6)","v":0},{"$f":"COUNTIF('Project Specific'!$F$24:$F$31,V$6)","v":0},{"$f":"COUNTIF('Project Specific'!$F$24:$F$31,W$6)","v":0}]
[null,"Document it",{"$f":"COUNTIF('Access & Input'!$G$7:$G$19,C$6)","v":0},{"$f":"COUNTIF('Access & Input'!$G$7:$G$19,D$6)","v":0},{"$f":"COUNTIF('Access & Input'!$G$7:$G$19,E$6)","v":0},{"$f":"COUNTIF('Access & Input'!$G$22:$G$25,F$6)","v":0},{"$f":"COUNTIF('Access & Input'!$G$22:$G$25,G$6)","v":0},{"$f":"COUNTIF('Access & Input'!$G$22:$G$25,H$6)","v":0},{"$f":"COUNTIF('Services & Housing'!$G$7:$G$20,I$6)","v":0},{"$f":"COUNTIF('Services & Housing'!$G$7:$G$20,J$6)","v":0},{"$f":"COUNTIF('Services & Housing'!$G$7:$G$20,K$6)","v":0},{"$f":"COUNTIF('Services & Housing'!$G$22:$G$29,L$6)","v":0},{"$f":"COUNTIF('Services & Housing'!$G$22:$G$29,M$6)","v":0},{"$f":"COUNTIF('Services & Housing'!$G$22:$G$29,N$6)","v":0},{"$f":"COUNTIF(Leases!$G$7:$G$20,O$6)","v":0},{"$f":"COUNTIF(Leases!$G$7:$G$20,P$6)","v":0},{"$f":"COUNTIF(Leases!$G$7:$G$20,Q$6)","v":0},{"$f":"COUNTIF('Project Specific'!$G$7:$G$22,R$6)","v":0},{"$f":"COUNTIF('Project Specific'!$G$7:$G$22,S$6)","v":0},{"$f":"COUNTIF('Project Specific'!$G$7:$G$22,T$6)","v":0},{"$f":"COUNTIF('Project Specific'!$G$24:$G$31,U$6)","v":0},{"$f":"COUNTIF('Project Specific'!$G$24:$G$31,V$6)","v":0},{"$f":"COUNTIF('Project Specific'!$G$24:$G$31,W$6)","v":0}]
[null,"Do it",{"$f":"COUNTIF('Access & Input'!$H$7:$H$19,C$6)","v":0},{"$f":"COUNTIF('Access & Input'!$H$7:$H$19,D$6)","v":0},{"$f":"COUNTIF('Access & Input'!$H$7:$H$19,E$6)","v":0},{"$f":"COUNTIF('Access & Input'!$H$22:$H$25,F$6)","v":0},{"$f":"COUNTIF('Access & Input'!$H$22:$H$25,G$6)","v":0},{"$f":"COUNTIF('Access & Input'!$H$22:$H$25,H$6)","v":0},{"$f":"COUNTIF('Services & Housing'!$F$7:$F$20,I$6)","v":0},{"$f":"COUNTIF('Services & Housing'!$F$7:$F$20,J$6)","v":0},{"$f":"COUNTIF('Services & Housing'!$H$7:$H$20,K$6)","v":0},{"$f":"COUNTIF('Services & Housing'!$H$22:$H$29,L$6)","v":0},{"$f":"COUNTIF('Services & Housing'!$H$22:$H$29,M$6)","v":0},{"$f":"COUNTIF('Services & Housing'!$H$22:$H$29,N$6)","v":0},{"$f":"COUNTIF(Leases!$H$7:$H$20,O$6)","v":0},{"$f":"COUNTIF(Leases!$H$7:$H$20,P$6)","v":0},{"$f":"COUNTIF(Leases!$H$7:$H$20,Q$6)","v":0},{"$f":"COUNTIF('Project Specific'!$H$7:$H$22,R$6)","v":0},{"$f":"COUNTIF('Project Specific'!$H$7:$H$22,S$6)","v":0},{"$f":"COUNTIF('Project Specific'!$H$7:$H$22,T$6)","v":0},{"$f":"COUNTIF('Project Specific'!$H$24:$H$31,U$6)","v":0},{"$f":"COUNTIF('Project Specific'!$H$24:$H$31,V$6)","v":0},{"$f":"COUNTIF('Project Specific'!$H$24:$H$31,W$6)","v":0}]
[null,"Checks",{"$f":"IF(MAX('Access & Input'!B7:B20)*3=SUM('Scratch - Report'!C7:E10),0,\"CHECK\")","v":0},null,null,{"$f":"IF(MAX('Access & Input'!B22:B25)*3=SUM('Scratch - Report'!F7:H10),0,\"CHECK\")","v":0},null,null,{"$f":"IF(MAX('Services & Housing'!B7:B20)*3=SUM('Scratch - Report'!I7:K10),0,\"CHECK\")","v":0},null,null,{"$f":"IF(MAX('Services & Housing'!B22:B29)*3=SUM('Scratch - Report'!L7:N10),0,\"CHECK\")","v":0},null,null,{"$f":"IF(MAX(Leases!B7:B20)*3=SUM('Scratch - Report'!O7:Q10),0,\"CHECK\")","v":0},null,null,{"$f":"IF(MAX('Project Specific'!B7:B22)*3=SUM('Scratch - Report'!R7:T10),0,\"CHECK\")","v":"CHECK"},null,null,{"$f":"IF(MAX('Project Specific'!B24:B31)*3=SUM('Scratch - Report'!U7:W10),0,\"CHECK\")","v":0}]
[]
[null,"Percentages","Access",null,null,"Participant Input",null,null,"Services",null,null,"Housing",null,null,"Leases",null,null,"Project-specific",null,null,"Population"]
[null,null,"Not at all","Somewhat","Always","Not at all","Somewhat","Always","Not at all","Somewhat","Always","Not at all","Somewhat","Always","Not at all","Somewhat","Always","Not at all","Somewhat","Always","Not at all","Somewhat","Always"]
[null,"Please select answer",{"$f":"C7/$C$19","v":3},null,null,{"$f":"F7/$F$19","v":3},null,null,{"$f":"I7/$I$19","v":3},null,null,{"$f":"L7/$L$19","v":3},null,null,{"$f":"O7/$O$19","v":3},null,null,{"$f":"R7/$R$19","v":4.8},null,null,{"$f":"U7/$U$19","v":3}]
[null,"Say it",{"$f":"C8/$C$19","v":0},{"$f":"D8/$C$19","v":0},0,{"$f":"F8/$F$19","v":0},{"$f":"G8/$F$19","v":0},0,{"$f":"I8/$I$19","v":0},{"$f":"J8/$I$19","v":0},0,{"$f":"L8/$L$19","v":0},{"$f":"M8/$L$19","v":0},0,{"$f":"O8/$O$19","v":0},{"$f":"P8/$O$19","v":0},0,{"$f":"R8/$R$19","v":0},{"$f":"S8/$R$19","v":0},0,{"$f":"U8/$U$19","v":0},{"$f":"V8/$U$19","v":0},0]
[null,"Document it",{"$f":"C9/$C$19","v":0},0,0,{"$f":"F9/$F$19","v":0},0,0,{"$f":"I9/$I$19","v":0},0,0,{"$f":"L9/$L$19","v":0},0,0,{"$f":"O9/$O$19","v":0},0,0,{"$f":"R9/$R$19","v":0},0,0,{"$f":"U9/$U$19","v":0},0,0]
[null,"Do it",{"$f":"C10/$C$19","v":0},0,0,{"$f":"F10/$F$19","v":0},0,0,{"$f":"I10/$I$19","v":0},0,0,{"$f":"L10/$L$19","v":0},0,0,{"$f":"O10/$O$19","v":0},0,0,{"$f":"R10/$R$19","v":0},0,0,{"$f":"U10/$U$19","v":0},0,0]
[null,"Number of standards",{"$f":"MAX('Access & Input'!B7:B20)","v":7},null,null,{"$f":"MAX('Access & Input'!B22:B25)","v":2},null,null,{"$f":"MAX('Services & Housing'!B7:B20)","v":7},null,null,{"$f":"MAX('Services & Housing'!B22:B29)","v":4},null,null,{"$f":"MAX(Leases!B7:B20)","v":7},null,null,{"$f":"MAX('Project Specific'!B7:B22)","v":5},null,null,{"$f":"MAX('Project Specific'!B24:B31)","v":4}]
[]
[]
[null,"'Say It'"]
[null,null,"Access","Participant Input","Services","Housing","Leases","Project","Population"]
[null,"Not at all",{"$f":"C16","v":0},{"$f":"F16","v":0},{"$f":"I16","v":0},{"$f":"L16","v":0},{"$f":"O16","v":0},{"$f":"R16","v":0},{"$f":"U16","v":0}]
[null,"Somewhat",{"$f":"D16","v":0},{"$f":"G16","v":0},{"$f":"J16","v":0},{"$f":"M16","v":0},{"$f":"P16","v":0},{"$f":"S16","v":0},{"$f":"V16","v":0}]
[null,"Always",{"$f":"E16","v":0},{"$f":"H16","v":0},{"$f":"K16","v":0},{"$f":"N16","v":0},{"$f":"Q16","v":0},{"$f":"T16","v":0},{"$f":"W16","v":0}]
[null,"Check",{"$f":"IF(SUM(C24:I26)=SUM(C16:W16),0,\"CHECK\")","v":0}]
[]
[null,"'Document It'"]
[null,null,"Access","Participant Input","Services","Housing","Leases","Project","Population"]
[null,"Not at all",{"$f":"C17","v":0},{"$f":"F17","v":0},{"$f":"I17","v":0},{"$f":"L17","v":0},{"$f":"O17","v":0},{"$f":"R17","v":0},{"$f":"U17","v":0}]
[null,"Somewhat",{"$f":"D17","v":0},{"$f":"G17","v":0},{"$f":"J17","v":0},{"$f":"M17","v":0},{"$f":"P17","v":0},{"$f":"S17","v":0},{"$f":"V17","v":0}]
[null,"Always",{"$f":"E17","v":0},{"$f":"H17","v":0},{"$f":"K17","v":0},{"$f":"N17","v":0},{"$f":"Q17","v":0},{"$f":"T17","v":0},{"$f":"W17","v":0}]
[null,"Check",{"$f":"IF(SUM(C31:I33)=SUM(C17:W17),0,\"CHECK\")","v":0}]
[]
[null,"'Do It'"]
[null,null,"Access","Participant Input","Services","Housing","Leases","Project","Population"]
[null,"Not at all",{"$f":"C18","v":0},{"$f":"F18","v":0},{"$f":"I18","v":0},{"$f":"L18","v":0},{"$f":"O18","v":0},{"$f":"R18","v":0},{"$f":"U18","v":0}]
[null,"Somewhat",{"$f":"D18","v":0},{"$f":"G18","v":0},{"$f":"J18","v":0},{"$f":"M18","v":0},{"$f":"P18","v":0},{"$f":"S18","v":0},{"$f":"V18","v":0}]
[null,"Always",{"$f":"E18","v":0},{"$f":"H18","v":0},{"$f":"K18","v":0},{"$f":"N18","v":0},{"$f":"Q18","v":0},{"$f":"T18","v":0},{"$f":"W18","v":0}]
[null,"Check",{"$f":"IF(SUM(C38:I40)=SUM(C18:W18),0,\"CHECK\")","v":0}]
[]
[]
[]
[null,"Supportive Housing Standards Rating",null,null,"Pointer"]
[null,"Start",0,null,"Value",{"$f":"C52","v":0}]
[null,"Initial",15,null,"Pointer",3]
[null,"Middle",45,null,"End",{"$f":"C75","v":216}]
[null,"End",40]
[null,"Max",100]
[]
[null,"Score:",{"$f":"SUM(D8:D10,G8:G10,J8:J10,M8:M10,P8:P10,S8:S10,V8:V10)+(SUM(E8:E10,H8:H10,K8:K10,N8:N10,Q8:Q10,T8:T10,W8:W10)*2)","v":0}]
[]
[null,"Standard Numbers","With special pop","Without special pop"]
[null,"Coordinated entry",{"$f":"MAX('Access & Input'!$B$7:$B$20)+MAX('Access & Input'!$B$22:$B$25)+MAX('Project Specific'!$B$7:$B$22)+MAX('Project Specific'!$B$24:$B$31)","v":18},{"$f":"MAX('Access & Input'!$B$7:$B$20)+MAX('Access & Input'!$B$22:$B$25)+MAX('Project Specific'!$B$7:$B$22)","v":14}]
[null,"Street outreach",{"$f":"MAX('Access & Input'!$B$7:$B$20)+MAX('Access & Input'!$B$22:$B$25)+MAX('Project Specific'!$B$7:$B$22)+MAX('Project Specific'!$B$24:$B$31)","v":18},{"$f":"MAX('Access & Input'!$B$7:$B$20)+MAX('Access & Input'!$B$22:$B$25)+MAX('Project Specific'!$B$7:$B$22)","v":14}]
[null,"Emergency shelter",{"$f":"MAX('Access & Input'!$B$7:$B$20)+MAX('Access & Input'!$B$22:$B$25)+MAX('Services & Housing'!$B$7:$B$20)+MAX('Services & Housing'!$B$22:$B$29)+MAX('Project Specific'!$B$7:$B$22)+MAX('Project Specific'!$B$24:$B$31)","v":29},{"$f":"MAX('Access & Input'!$B$7:$B$20)+MAX('Access & Input'!$B$22:$B$25)+MAX('Services & Housing'!$B$7:$B$20)+MAX('Services & Housing'!$B$22:$B$29)+MAX('Project Specific'!$B$7:$B$22)","v":25}]
[null,"Transitional housing",{"$f":"MAX('Access & Input'!$B$7:$B$20)+MAX('Access & Input'!$B$22:$B$25)+MAX('Services & Housing'!$B$7:$B$20)+MAX('Services & Housing'!$B$22:$B$29)+MAX(Leases!$B$7:$B$20)+MAX('Project Specific'!$B$7:$B$22)+MAX('Project Specific'!$B$24:$B$31)","v":36},{"$f":"MAX('Access & Input'!$B$7:$B$20)+MAX('Access & Input'!$B$22:$B$25)+MAX('Services & Housing'!$B$7:$B$20)+MAX('Services & Housing'!$B$22:$B$29)+MAX(Leases!$B$7:$B$20)+MAX('Project Specific'!$B$7:$B$22)","v":32}]
[null,"Rapid rehousing",{"$f":"MAX('Access & Input'!$B$7:$B$20)+MAX('Access & Input'!$B$22:$B$25)+MAX('Services & Housing'!$B$7:$B$20)+MAX('Services & Housing'!$B$22:$B$29)+MAX(Leases!$B$7:$B$20)+MAX('Project Specific'!$B$7:$B$22)+MAX('Project Specific'!$B$24:$B$31)","v":36},{"$f":"MAX('Access & Input'!$B$7:$B$20)+MAX('Access & Input'!$B$22:$B$25)+MAX('Services & Housing'!$B$7:$B$20)+MAX('Services & Housing'!$B$22:$B$29)+MAX(Leases!$B$7:$B$20)+MAX('Project Specific'!$B$7:$B$22)","v":32}]
[null,"Permanent supportive housing",{"$f":"MAX('Access & Input'!$B$7:$B$20)+MAX('Access & Input'!$B$22:$B$25)+MAX('Services & Housing'!$B$7:$B$20)+MAX('Services & Housing'!$B$22:$B$29)+MAX(Leases!$B$7:$B$20)+MAX('Project Specific'!$B$7:$B$22)+MAX('Project Specific'!$B$24:$B$31)","v":36},{"$f":"MAX('Access & Input'!$B$7:$B$20)+MAX('Access & Input'!$B$22:$B$25)+MAX('Services & Housing'!$B$7:$B$20)+MAX('Services & Housing'!$B$22:$B$29)+MAX(Leases!$B$7:$B$20)+MAX('Project Specific'!$B$7:$B$22)","v":32}]
[]
[null,"Max answer score (for 'always')",6,"3 categories (say, document, do) x 2 max points for 'always'"]
[]
[null,"Answer Numbers","With special pop","Without special pop"]
[null,"Coordinated entry",{"$f":"C55*$C$62","v":108},{"$f":"D55*$C$62","v":84},1]
[null,"Street outreach",108,84,1]
[null,"Emergency shelter",174,150,2]
[null,"Transitional housing",216,192,3]
[null,"Rapid rehousing",216,192,3]
[null,"Permanent supportive housing",216,192,3]
[]
[null,"Project type",{"$f":"'Provider Info'!C23","v":"Joint Transitional Housing & Rapid Rehousing"},null,null,{"$f":"IF($C$72=B65,1,IF(C72=B66,1,IF(C72=B67,2,3)))","v":3}]
[null,"Special population",{"$f":"'Provider Info'!C26","v":"People in Recovery"},null,null,{"$f":"IF(C73=\"None of the above\",0,1)","v":1}]
[]
[null,"Evaluation max score",{"$f":"IF(AND(F72=1,F73=0),D65,IF(AND(F72=1,F73=1),C65,IF(AND(F72=2,F73=0),D67,IF(AND(F72=2,F73=1),C67,IF(AND(F72=3,F73=0),D69,C69)))))","v":216}]

{"sheet":"Assumptions","index":9,"n_rows":30,"n_cols":15,"rows_kept":30,"cut":false,"hidden":true,"merged":[]}
["Assumptions for the standards"]
[]
[null,"This page does not comprise part of the assessment. It is for information only."]
[]
[null,"Project standards",null,null,null,null,null,null,null,null,"Project standards"]
[null,"Standards","Coordinated Entry","Street Outreach","Emergency Shelter","Transitional Housing","Rapid Rehousing","Permanent Supportive Housing","Joint Transitional Housing & Rapid Rehousing",null,null,"Youth and Young Adults","People in Recovery","Domestic Violence Survivors","None of the above"]
[null,"Title","Coordinated Entry does not screen people out for perceived barriers","Projects screen for health and safety needs","Focus of emergency shelter is on safe and responsive temporary shelter","Quick access to TH assistance","Quick access to RRH assistance","Quick access to PSH assistance","Quick access to RRH assistance",null,"Title","Services are offered","Recovery housing is offered as one choice among other housing opportunities","Participant safety is a priority at all points of engagement and in all planning processes"]
[null,1,"Coordinated Entry does not screen people out for assistance due to perceived barriers related to housing or services, including, but not limited to, too little or no income, active or a history of substance use, domestic violence history, minimal linkages to other services, the type or extent of disability-related services or supports that are needed, or criminal justice history. ","Outreach projects screen people contacted through outreach as soon as possible for critical health and safety needs, providing immediate response to people with the most severe needs.","Participants and staff understand that the primary goals of the emergency shelter are to provide temporary accommodation that is safe, respectful, and responsive to individual needs and that participants are offered permanent housing as quickly as possible, regardless of perceived barriers.","A transitional housing project ensures quick linkage to a unit and services based on participant choice.  ","A Rapid Re-housing project ensures quick linkage to rapid re-housing assistance, based on participant choice. ","A permanent supportive housing project ensures quick linkage to a unit and wrap around services, based on participant needs, preferences, and resource availability.","A Rapid Re-housing project ensures quick linkage to rapid re-housing assistance, based on participant choice. ",null,1,"Services are focused on ensuring that youth transition to independence.","Connection to recovery housing reflects individual choice for this path toward recovery. Abstinence-only spaces are incorporated into a Housing First model wherever possible, thus providing this type of recovery option to those who choose it. Recovery supports are offered, particularly connections to community-based treatment options.","Led by the survivor, a safety plan is developed that includes an assessment of danger, particular points of vulnerability, and best approaches to increasing safety."]
[null,null,"Type notes here, if required","Type notes here, if required","Type notes here, if required","Type notes here, if required","Type notes here, if required","Type notes here, if required","Type notes here, if required",null,null,"Type notes here, if required","Type notes here, if required","Type notes here, if required"]
[null,"Title","Process to assess project-level policies and alert CoC","Street outreach projects are focused on providing access to housing and services","Housing comes first","Transitional housing is focused on safe and quick transitions to permanent housing","RRH services support people in maintaining their housing","PSH is focused on ending homelessness for those with the most severe barriers to maintaining housing","RRH services support people in maintaining their housing",null,"Title","Projects include positive youth development principles","Services include relapse support","Survivor-driven advocacy is available"]
[null,{"$f":"B8+1","v":2},"Written policies and procedures exist to determine which projects have project-level policies that screen out “high barrier” households, and the  steps that the coordinated entry provider will take to alert the CoC of these projects, thereby enabling the CoC to take steps to assist these projects in adopting Housing First principles.","Participants and staff understand that the primary goals of street outreach are to provide access to temporary housing and services and/or re-housing participants in permanent housing as quickly as possible, regardless of perceived barriers. Street outreach projects reflect the low-barrier orientation of the Coordinated Entry process. ","If a temporary shelter placement is made, assessment and planning for permanent housing placement begins as quickly as possible. People who are unsheltered are not required to first enter an emergency shelter in order to access permanent housing placement assistance and enter permanent housing.  ","Participants and staff understand that the primary goals of transitional housing are to provide temporary accommodations that are safe, respectful, and responsive to individual needs, address the service needs of participants, and re-house participants in permanent housing as quickly as possible, regardless of other personal issues or concerns, and as desired by the participant.  Participation in transitional housing services does not inhibit participants from moving to permanent housing when they choose to. Assessment and planning for permanent housing placement begins as soon as the individual or family expresses a desire to transition to permanent housing.","Participants and staff understand that a primary goal of rapid re-housing is to end homelessness and move participants to permanent housing as quickly as possible, regardless of perceived barriers.","Participants and staff understand that a primary goal of permanent supportive housing is to end homelessness for people with the most severe service needs and help participants stay housed, regardless of other perceived barriers.","Participants and staff understand that a primary goal of rapid re-housing is to end homelessness and move participants to permanent housing as quickly as possible, regardless of perceived barriers.",null,{"$f":"K8+1","v":2},"Youth projects should include positive youth development orientation. Positive youth development builds on strengths and resiliency. By focusing on strengths and assets, rather than what might be “wrong,” youth are empowered and are equipped to make positive decisions. ","Housing and services include relapse support that does not automatically evict or discharge a participant from the project for temporary relapse. Relapse support might  include referrals to outpatient treatment or direct provision of outpatient services or the ability to hold a unit for a certain period of time (30-90 days) while the participant undergoes residential treatment.","The unique needs and strengths of each individual survivor and their children are taken into account with regard to the types of services that are available and offered. Project uses flexible and survivor-focused approaches to overcome barriers survivors may face in accessing services through traditional models."]
[null,null,"Type notes here, if required","Type notes here, if required","Type notes here, if required","Type notes here, if required","Type notes here, if required","Type notes here, if required","Type notes here, if required",null,null,"Type notes here, if required","Type notes here, if required","Type notes here, if required"]
[null,"Title","RRH as a bridge to permanent supportive housing","Street outreach is linked to Coordinated Entry"," ","TH projects provide appropriate services","Providers continuously assess a participant’s need for assistance","Property Management duties are separate and distinct from services/case management","Providers continuously assess a participant’s need for assistance",null,"Title","Staff use harm reduction practices and approaches","Services support sustained recovery","Housing stability is a priority"]
[null,{"$f":"B11+1","v":3},"Rapid Re-Housing is made available to serve as a bridge to other permanent housing options so that persons with high service needs or vulnerabilities can be housed more quickly.  (See HUD’s Rapid Re-Housing Brief here: https://www.hudexchange.info/resources/documents/Rapid-Re-Housing-Brief.pdf)","Written policy and procedures detail a process by which street outreach staff ensures that persons encountered on the streets are offered the same standardized processes as persons assessed through site-based access points. Outreach teams are coordinated, trained, and have the ability to engage and quickly connect people experiencing homelessness to the local coordinated entry process in order to apply for and obtain permanent housing. Based on the CoC’s decision about how street outreach is incorporated into the assessment process, street outreach projects must comply with the CoC’s decision.","No additional standards","TH projects provide appropriate services to meet the participants health and safety needs (e.g., persons in early recovery; domestic violence survivors; those who need special accommodations) when there are no permanent housing solutions available (with or without supportive services) or when the participant chooses transitional housing. Services are not required in order to participate in housing.","On an ongoing basis, providers assess a participant’s needs for continued assistance and provide tailored assistance based on those assessments.","In order to provide clear roles of staff for participants in terms of lease and rules enforcement as well as tenant advocacy, property management and service provider staff should be separate roles. However, they should work together on a regular basis through regular communications and meetings regarding Participants to address tenancy issues in order to preserve tenancy.  ","On an ongoing basis, providers assess a participant’s needs for continued assistance and provide tailored assistance based on those assessments.",null,{"$f":"K11+1","v":3},"Youth models employ a harm reduction and recovery orientation, including those developed for youth and young adults with substance use and addictions.  Projects may make abstinence-based models available for youth and young adults; however, the choice should lie with the participant, not with the project.  ","Recovery housing projects provide services that align with participants’ choice and prioritization of recovery, including but not limited to abstinence from substances (if that is a personal goal), long-term permanent housing stability, and stable income through employment or benefits. Support is offered through connections to community-based treatment options.","Providers support survivors and their children to retain or obtain safe, stable housing. Survivors choose the type of housing and location of housing. Housing is located in an area that is considered safe from the abusive relationship."]
[null,null,"Type notes here, if required","Type notes here, if required",null,"Type notes here, if required","Type notes here, if required","Type notes here, if required","Type notes here, if required",null,null,"Type notes here, if required","Type notes here, if required","Type notes here, if required"]
[null,"Title"," ","Street outreach continuously engages those experiencing homelessness and on the street"," ","Housing comes first"," "," ","Transitional housing is focused on safe and quick transitions to permanent housing",null,"Title","Project design accounts for the age of youth and young adults to be served"]
[null,{"$f":"B14+1","v":4},"No additional standards"," Through continuous engagement strategies, a street outreach project provides quick linkage to housing and services when a person is ready to engage.","No additional standards","No individuals or families, including those who are unsheltered, are required to enter a transitional housing project in order to access permanent housing placement assistance and enter permanent housing.","No additional standards","No additional standards","Participants and staff understand that the primary goals of transitional housing are to provide temporary accommodations that are safe, respectful, and responsive to individual needs, address the services needs of participants, and re-house participants in permanent housing as quickly as possible, regardless of other personal issues or concerns, and as desired by the participant. Participation in transitional housing services does not inhibit participants from moving to permanent housing when they choose to. Assessment and planning for permanent housing placement begins as soon as the individual or family expresses a desire to transition to permanent housing.",null,{"$f":"K14+1","v":4},"Developmentally-appropriate project design ensures that project entry and on-going participation is not predicated on behaviors or experiences that youth and young adults may not currently have or if they were older would not result in consequences.  For example, projects should accept and allow continued participation for youth who do not have income or immediate prospects of income because their age has not allowed them the opportunity to gain employment.  ","No additional standards","No additional standards"]
[null,null,null,null,null,"Type notes here, if required",null,null,"Type notes here, if required",null,null,"Type notes here, if required"]
[null,"Title"," ","Street Outreach engagements inform the community’s efforts to improve their crisis response system "," "," "," "," ","TH projects provide appropriate services"]
[null,{"$f":"B17+1","v":5},"No additional standards","Communities use street outreach engagements with those on the street and in encampments to understand and remove barriers to those accessing the crisis response system.","No additional standards","No additional standards","No additional standards","No additional standards","TH projects provide appropriate services to meet the participants health and safety needs (e.g., persons in early recovery; domestic violence survivors; those who need special accommodations) when there are no permanent housing solutions available (with or without supportive services) or when the participant chooses transitional housing. Services are not required in order to participate in housing."]
[null,null,null,"Type notes here, if required",null,null,null,null,"Type notes here, if required"]
[null,"Title"," "," "," "," "," "," "," "]
[null,{"$f":"B20+1","v":6},"No additional standards","No additional standards","No additional standards","No additional standards","No additional standards","No additional standards","No additional standards"]
[null,null,null,"  ",null,null," "," "]
[null,"Title"," "," "," "," "," "," "," "]
[null,{"$f":"B23+1","v":7},"No additional standards","No additional standards","No additional standards","No additional standards","No additional standards","No additional standards","No additional standards"]
[null,null,null,"  ",null,null," "," "]
[null,"Title"," "," "," "," "," "," "," "]
[null,{"$f":"B26+1","v":8},"No additional standards","No additional standards","No additional standards","No additional standards","No additional standards","No additional standards","No additional standards"]
[null,null,null,"  ","  ","  ","  ","  "]