{"text_format":"1","workbook":"xlsx","n_sheets":10,"sheets":["Instructions","Provider Info","Access & Input","Leases","Services & Housing","Project Specific","Report Summary","Scratch - List","Scratch - Report","Assumptions"],"not_rendered":{"charts":8,"images":1,"macros":1,"external_links":0,"defined_names":6,"comments":0,"pivot_tables":0},"unopened":[],"bounds":{"document_bytes":16777216,"sheet_cells":100000,"rows_first":2000,"rows_last":500,"rows_between":2000,"halvings":0,"cell_chars":16384,"cell_head_chars":4096},"cells_cut":0,"cells_raw":0,"read":"whole","date_system":"1900"}

{"sheet":"Instructions","index":0,"n_rows":57,"n_cols":5,"rows_kept":57,"cut":false,"hidden":false,"merged":[]}
[]
[]
[]
[]
[]
[]
{"$rows_left_out":52}
{"sheet":"Provider Info","index":1,"n_rows":44,"n_cols":3,"rows_kept":44,"cut":false,"hidden":false,"merged":[[23,1,23,2]]}
["Provider Information"]
[]
[null,"Please complete the information below on the organization being assessed."]
[]
[null,"Provider Information"]
[null,"Provider's Legal Name","[Test Provider]"]
{"$rows_left_out":39}
{"sheet":"Access & Input","index":2,"n_rows":25,"n_cols":8,"rows_kept":25,"cut":false,"hidden":false,"merged":[]}
[null,"Housing First Standards"]
[]
[null,null,"For each standard, please use the drop down boxes in the three columns to the right to select “Not at all” or “Sometimes” or \"Always\". Marking \"Always\" "]
[null,null,"signifies full compliance for the standard."]
[]
[null,"No.","Standard","Access Definition / Evidence",null,"Say It","Document it","Do it"]
{"$rows_left_out":20}
{"sheet":"Leases","index":3,"n_rows":20,"n_cols":11,"rows_kept":20,"cut":false,"hidden":false,"merged":[]}
[null,"Housing First Standards"]
[]
[null,null,"For each standard, please use the drop down boxes in the three columns to the right to select “Not at all” or “Sometimes” or \"Always\". Marking \"Always\" "]
[null,null,"signifies full compliance for the standard."]
[]
[null,null,{"$f":"IF(OR('Provider Info'!$C$23=\"Coordinated Entry\",'Provider Info'!$C$23=\"Street Outreach\",'Provider Info'!$C$23=\"Emergency Shelter\"),\"\",\"Standard\")","v":"Standard"},{"$f":"IF(OR('Provider Info'!$C$23=\"Coordinated Entry\",'Provider Info'!$C$23=\"Street Outreach\",'Provider Info'!$C$23=\"Emergency Shelter\"),\"This section is not applicable. Please see following section.\",\"Lease and Occupancy Definition / Evidence\")","v":"Lease and Occupancy Definition / Evidence"},null,{"$f":"IF(OR('Provider Info'!$C$23=\"Coordinated Entry\",'Provider Info'!$C$23=\"Street Outreach\",'Provider Info'!$C$23=\"Emergency Shelter\"),\"\",\"Say It\")","v":"Say It"},{"$f":"IF(OR('Provider Info'!$C$23=\"Coordinated Entry\",'Provider Info'!$C$23=\"Street Outreach\",'Provider Info'!$C$23=\"Emergency Shelter\"),\"\",\"Document It\")","v":"Document It"},{"$f":"IF(OR('Provider Info'!$C$23=\"Coordinated Entry\",'Provider Info'!$C$23=\"Street Outreach\",'Provider Info'!$C$23=\"Emergency Shelter\"),\"\",\"Do It\")","v":"Do It"},null,"Name"]
{"$rows_left_out":15}
{"sheet":"Services & Housing","index":4,"n_rows":29,"n_cols":11,"rows_kept":29,"cut":false,"hidden":false,"merged":[]}
[null,"Housing First Standards"]
[]
[null,null,"For each standard, please use the drop down boxes in the three columns to the right to select “Not at all” or “Sometimes” or \"Always\". Marking \"Always\" "]
[null,null,"signifies full compliance for the standard."]
[]
[null,null,{"$f":"IF(OR('Provider Info'!$C$23=\"Coordinated Entry\",'Provider Info'!$C$23=\"Street Outreach\"),\"\",\"Standard\")","v":"Standard"},{"$f":"IF(OR('Provider Info'!$C$23=\"Coordinated Entry\",'Provider Info'!$C$23=\"Street Outreach\"),\"This section is not applicable. Please see following section.\",\"Services Definition / Evidence\")","v":"Services Definition / Evidence"},null,{"$f":"IF(OR('Provider Info'!$C$23=\"Coordinated Entry\",'Provider Info'!$C$23=\"Street Outreach\"),\"\",\"Say it\")","v":"Say it"},{"$f":"IF(OR('Provider Info'!$C$23=\"Coordinated Entry\",'Provider Info'!$C$23=\"Street Outreach\"),\"\",\"Document it\")","v":"Document it"},{"$f":"IF(OR('Provider Info'!$C$23=\"Coordinated Entry\",'Provider Info'!$C$23=\"Street Outreach\"),\"\",\"Do it\")","v":"Do it"}]
{"$rows_left_out":24}
{"sheet":"Project Specific","index":5,"n_rows":31,"n_cols":8,"rows_kept":31,"cut":false,"hidden":false,"merged":[]}
[null,"Housing First Standards"]
[]
[null,null,"For each standard, please use the drop down boxes in the three columns to the right to select “Not at all” or “Sometimes” or \"Always\". Marking \"Always\" "]
[null,null,"signifies full compliance for the standard."]
[]
[null,null,"Standard","Project -Specific Standards",null,"Say It","Document it","Do it"]
{"$rows_left_out":26}
{"sheet":"Report Summary","index":6,"n_rows":69,"n_cols":16,"rows_kept":69,"cut":false,"hidden":false,"merged":[[68,4,68,7],[52,4,52,7],[54,4,54,7],[56,4,56,7],[58,4,58,7],[60,4,60,7],[59,4,59,7],[57,4,57,7],[62,4,62,7],[64,4,64,7],[66,4,66,7],[63,4,63,7],[65,4,65,7],[67,4,67,7],[61,4,61,7],[75,3,75,7],[69,3,69,7],[70,3,70,7],[71,3,71,7],[72,3,72,7],[73,3,73,7],[74,3,74,7],[6,1,6,7],[51,4,51,7],[53,4,53,7],[55,4,55,7],[50,4,50,7],[41,4,41,7],[43,4,43,7],[45,4,45,7],[47,4,47,7],[42,4,42,7],[44,4,44,7],[46,4,46,7],[48,4,48,7],[49,4,49,7]]}
[null,"Housing First Standards: Assessment Summary"]
[]
[null,{"$f":"'Provider Info'!C6","v":"[Test Provider]"}]
[null,{"$f":"'Provider Info'!C44","v":"2016-11-02"}]
[]
[]
{"$rows_left_out":64}
{"sheet":"Scratch - List","index":7,"n_rows":98,"n_cols":25,"rows_kept":98,"cut":false,"hidden":true,"merged":[]}
["Comply","Document","Evidence","No. ","Name","Standard","Category","Notes","Not at all",null,null,null,null,"Not at all",null,null,null,null,"Not at all"]
[{"$f":"'Access & Input'!F7","v":"Please select answer"},{"$f":"'Access & Input'!G7","v":"Please select answer"},{"$f":"'Access & Input'!H7","v":"Please select answer"},{"$f":"'Access & Input'!B7","v":1},{"$f":"'Access & Input'!C7","v":"Projects are low-barrier"},{"$f":"'Access & Input'!D7","v":"Admission to projects is not contingent on pre-requisites such as abstinence of substances, minimum income requirements, health or mental health history, medication adherence, age, criminal justice history, financial history, completion of treatment, participation in services, “housing readiness,” history or occurrence of victimization, survivor of sexual assault or an affiliated person of such a survivor or other unnecessary conditions unless required by law or funding source."},"Access",{"$f":"F3","v":"Optional notes here"},{"$f":"IF(ISERROR(INDEX($A$1:$G$79,SMALL(IF($A$1:$A$79=$I$1,ROW($A$1:$A$79)),ROW(1:1)),7)),\"\",INDEX($A$1:$G$79,SMALL(IF($A$1:$A$79=$I$1,ROW($A$1:$A$79)),ROW(1:1)),7))","v":""},{"$f":"IF(ISERROR(INDEX($A$1:$G$79,SMALL(IF($A$1:$A$79=$I$1,ROW($A$1:$A$79)),ROW(1:1)),4)),\"\",INDEX($A$1:$G$79,SMALL(IF($A$1:$A$79=$I$1,ROW($A$1:$A$79)),ROW(1:1)),4))","v":""},{"$f":"IF(ISERROR(INDEX($A$1:$G$79,SMALL(IF($A$1:$A$79=$I$1,ROW($A$1:$A$79)),ROW(1:1)),5)),\"\",INDEX($A$1:$G$79,SMALL(IF($A$1:$A$79=$I$1,ROW($A$1:$A$79)),ROW(1:1)),5))","v":""},{"$f":"IF(ISERROR(INDEX($A$1:$G$79,SMALL(IF($A$1:$A$79=$I$1,ROW($A$1:$A$79)),ROW(1:1)),6)),\"\",INDEX($A$1:$G$79,SMALL(IF($A$1:$A$79=$I$1,ROW($A$1:$A$79)),ROW(1:1)),6))","v":""},{"$f":"IF(ISERROR(INDEX($A$1:$H$79,SMALL(IF($A$1:$A$79=$I$1,ROW($A$1:$A$79)),ROW(1:1)),8)),\"\",INDEX($A$1:$H$79,SMALL(IF($A$1:$A$79=$I$1,ROW($A$1:$A$79)),ROW(1:1)),8))","v":""},{"$f":"IF(ISERROR(INDEX($A$1:$G$79,SMALL(IF($B$1:$B$79=$N$1,ROW($B$1:$B$79)),ROW(1:1)),6)),\"\",INDEX($A$1:$G$79,SMALL(IF($B$1:$B$79=$N$1,ROW($B$1:$B$79)),ROW(1:1)),6))","v":""},{"$f":"IF(ISERROR(INDEX($A$1:$G$79,SMALL(IF($B$1:$B$79=$N$1,ROW($B$1:$B$79)),ROW(1:1)),4)),\"\",INDEX($A$1:$G$79,SMALL(IF($B$1:$B$79=$N$1,ROW($B$1:$B$79)),ROW(1:1)),4))","v":""},{"$f":"IF(ISERROR(INDEX($A$1:$G$79,SMALL(IF($B$1:$B$79=$N$1,ROW($B$1:$B$79)),ROW(1:1)),5)),\"\",INDEX($A$1:$G$79,SMALL(IF($B$1:$B$79=$N$1,ROW($B$1:$B$79)),ROW(1:1)),5))","v":""},{"$f":"IF(ISERROR(INDEX($A$1:$G$79,SMALL(IF($B$1:$B$79=$N$1,ROW($B$1:$B$79)),ROW(1:1)),7)),\"\",INDEX($A$1:$G$79,SMALL(IF($B$1:$B$79=$N$1,ROW($B$1:$B$79)),ROW(1:1)),7))","v":""},{"$f":"IF(ISERROR(INDEX($A$1:$H$79,SMALL(IF($B$1:$B$79=$N$1,ROW($B$1:$B$79)),ROW(1:1)),8)),\"\",INDEX($A$1:$H$79,SMALL(IF($B$1:$B$79=$N$1,ROW($B$1:$B$79)),ROW(1:1)),8))","v":""},{"$f":"IF(ISERROR(INDEX($A$1:$G$79,SMALL(IF($C$1:$C$79=$S$1,ROW($C$1:$C$79)),ROW(1:1)),6)),\"\",INDEX($A$1:$G$79,SMALL(IF($C$1:$C$79=$S$1,ROW($C$1:$C$79)),ROW(1:1)),6))","v":""},{"$f":"IF(ISERROR(INDEX($A$1:$G$79,SMALL(IF($C$1:$C$79=$S$1,ROW($C$1:$C$79)),ROW(1:1)),4)),\"\",INDEX($A$1:$G$79,SMALL(IF($C$1:$C$79=$S$1,ROW($C$1:$C$79)),ROW(1:1)),4))","v":""},{"$f":"IF(ISERROR(INDEX($A$1:$G$79,SMALL(IF($C$1:$C$79=$S$1,ROW($C$1:$C$79)),ROW(1:1)),5)),\"\",INDEX($A$1:$G$79,SMALL(IF($C$1:$C$79=$S$1,ROW($C$1:$C$79)),ROW(1:1)),5))","v":""},{"$f":"IF(ISERROR(INDEX($A$1:$G$79,SMALL(IF($C$1:$C$79=$S$1,ROW($C$1:$C$79)),ROW(1:1)),7)),\"\",INDEX($A$1:$G$79,SMALL(IF($C$1:$C$79=$S$1,ROW($C$1:$C$79)),ROW(1:1)),7))","v":""},{"$f":"IF(ISERROR(INDEX($A$1:$H$79,SMALL(IF($C$1:$C$79=$S$1,ROW($C$1:$C$79)),ROW(1:1)),8)),\"\",INDEX($A$1:$H$79,SMALL(IF($C$1:$C$79=$S$1,ROW($C$1:$C$79)),ROW(1:1)),8))","v":""}," ","Order of columns:"]
[{"$f":"'Access & Input'!F8","v":0},{"$f":"'Access & Input'!G8","v":0},{"$f":"'Access & Input'!H8","v":0},{"$f":"'Access & Input'!B8","v":0},{"$f":"'Access & Input'!C8","v":0},{"$f":"'Access & Input'!D8","v":"Optional notes here"},"Access",0,{"$f":"IF(ISERROR(INDEX($A$1:$G$79,SMALL(IF($A$1:$A$79=$I$1,ROW($A$1:$A$79)),ROW(2:2)),7)),\"\",INDEX($A$1:$G$79,SMALL(IF($A$1:$A$79=$I$1,ROW($A$1:$A$79)),ROW(2:2)),7))","v":""},{"$f":"IF(ISERROR(INDEX($A$1:$G$79,SMALL(IF($A$1:$A$79=$I$1,ROW($A$1:$A$79)),ROW(2:2)),4)),\"\",INDEX($A$1:$G$79,SMALL(IF($A$1:$A$79=$I$1,ROW($A$1:$A$79)),ROW(2:2)),4))","v":""},{"$f":"IF(ISERROR(INDEX($A$1:$G$79,SMALL(IF($A$1:$A$79=$I$1,ROW($A$1:$A$79)),ROW(2:2)),5)),\"\",INDEX($A$1:$G$79,SMALL(IF($A$1:$A$79=$I$1,ROW($A$1:$A$79)),ROW(2:2)),5))","v":""},{"$f":"IF(ISERROR(INDEX($A$1:$G$79,SMALL(IF($A$1:$A$79=$I$1,ROW($A$1:$A$79)),ROW(2:2)),6)),\"\",INDEX($A$1:$G$79,SMALL(IF($A$1:$A$79=$I$1,ROW($A$1:$A$79)),ROW(2:2)),6))","v":""},{"$f":"IF(ISERROR(INDEX($A$1:$H$79,SMALL(IF($A$1:$A$79=$I$1,ROW($A$1:$A$79)),ROW(2:2)),8)),\"\",INDEX($A$1:$H$79,SMALL(IF($A$1:$A$79=$I$1,ROW($A$1:$A$79)),ROW(2:2)),8))","v":""},{"$f":"IF(ISERROR(INDEX($A$1:$G$79,SMALL(IF($B$1:$B$79=$N$1,ROW($B$1:$B$79)),ROW(2:2)),6)),\"\",INDEX($A$1:$G$79,SMALL(IF($B$1:$B$79=$N$1,ROW($B$1:$B$79)),ROW(2:2)),6))","v":""},{"$f":"IF(ISERROR(INDEX($A$1:$G$79,SMALL(IF($B$1:$B$79=$N$1,ROW($B$1:$B$79)),ROW(2:2)),4)),\"\",INDEX($A$1:$G$79,SMALL(IF($B$1:$B$79=$N$1,ROW($B$1:$B$79)),ROW(2:2)),4))","v":""},{"$f":"IF(ISERROR(INDEX($A$1:$G$79,SMALL(IF($B$1:$B$79=$N$1,ROW($B$1:$B$79)),ROW(2:2)),5)),\"\",INDEX($A$1:$G$79,SMALL(IF($B$1:$B$79=$N$1,ROW($B$1:$B$79)),ROW(2:2)),5))","v":""},{"$f":"IF(ISERROR(INDEX($A$1:$G$79,SMALL(IF($B$1:$B$79=$N$1,ROW($B$1:$B$79)),ROW(2:2)),7)),\"\",INDEX($A$1:$G$79,SMALL(IF($B$1:$B$79=$N$1,ROW($B$1:$B$79)),ROW(2:2)),7))","v":""},{"$f":"IF(ISERROR(INDEX($A$1:$H$79,SMALL(IF($B$1:$B$79=$N$1,ROW($B$1:$B$79)),ROW(2:2)),8)),\"\",INDEX($A$1:$H$79,SMALL(IF($B$1:$B$79=$N$1,ROW($B$1:$B$79)),ROW(2:2)),8))","v":""},{"$f":"IF(ISERROR(INDEX($A$1:$G$79,SMALL(IF($C$1:$C$79=$S$1,ROW($C$1:$C$79)),ROW(2:2)),6)),\"\",INDEX($A$1:$G$79,SMALL(IF($C$1:$C$79=$S$1,ROW($C$1:$C$79)),ROW(2:2)),6))","v":""},{"$f":"IF(ISERROR(INDEX($A$1:$G$79,SMALL(IF($C$1:$C$79=$S$1,ROW($C$1:$C$79)),ROW(2:2)),4)),\"\",INDEX($A$1:$G$79,SMALL(IF($C$1:$C$79=$S$1,ROW($C$1:$C$79)),ROW(2:2)),4))","v":""},{"$f":"IF(ISERROR(INDEX($A$1:$G$79,SMALL(IF($C$1:$C$79=$S$1,ROW($C$1:$C$79)),ROW(2:2)),5)),\"\",INDEX($A$1:$G$79,SMALL(IF($C$1:$C$79=$S$1,ROW($C$1:$C$79)),ROW(2:2)),5))","v":""},{"$f":"IF(ISERROR(INDEX($A$1:$G$79,SMALL(IF($C$1:$C$79=$S$1,ROW($C$1:$C$79)),ROW(2:2)),7)),\"\",INDEX($A$1:$G$79,SMALL(IF($C$1:$C$79=$S$1,ROW($C$1:$C$79)),ROW(2:2)),7))","v":""},{"$f":"IF(ISERROR(INDEX($A$1:$H$79,SMALL(IF($C$1:$C$79=$S$1,ROW($C$1:$C$79)),ROW(2:2)),8)),\"\",INDEX($A$1:$H$79,SMALL(IF($C$1:$C$79=$S$1,ROW($C$1:$C$79)),ROW(2:2)),8))","v":""}," ","Non compliant (G-I)"]
[{"$f":"'Access & Input'!F9","v":"Please select answer"},{"$f":"'Access & Input'!G9","v":"Please select answer"},{"$f":"'Access & Input'!H9","v":"Please select answer"},{"$f":"'Access & Input'!B9","v":2},{"$f":"'Access & Input'!C9","v":"Projects do not deny assistance for unnecessary reasons"},{"$f":"'Access & Input'!D9","v":"Procedures and oversight demonstrate that staff do everything possible to avoid denying assistance or rejecting an individual or family for the reasons listed in Access Standard #1.  "},"Access",{"$f":"F5","v":"Optional notes here"},{"$f":"IF(ISERROR(INDEX($A$1:$G$79,SMALL(IF($A$1:$A$79=$I$1,ROW($A$1:$A$79)),ROW(3:3)),7)),\"\",INDEX($A$1:$G$79,SMALL(IF($A$1:$A$79=$I$1,ROW($A$1:$A$79)),ROW(3:3)),7))","v":""},{"$f":"IF(ISERROR(INDEX($A$1:$G$79,SMALL(IF($A$1:$A$79=$I$1,ROW($A$1:$A$79)),ROW(3:3)),4)),\"\",INDEX($A$1:$G$79,SMALL(IF($A$1:$A$79=$I$1,ROW($A$1:$A$79)),ROW(3:3)),4))","v":""},{"$f":"IF(ISERROR(INDEX($A$1:$G$79,SMALL(IF($A$1:$A$79=$I$1,ROW($A$1:$A$79)),ROW(3:3)),5)),\"\",INDEX($A$1:$G$79,SMALL(IF($A$1:$A$79=$I$1,ROW($A$1:$A$79)),ROW(3:3)),5))","v":""},{"$f":"IF(ISERROR(INDEX($A$1:$G$79,SMALL(IF($A$1:$A$79=$I$1,ROW($A$1:$A$79)),ROW(3:3)),6)),\"\",INDEX($A$1:$G$79,SMALL(IF($A$1:$A$79=$I$1,ROW($A$1:$A$79)),ROW(3:3)),6))","v":""},{"$f":"IF(ISERROR(INDEX($A$1:$H$79,SMALL(IF($A$1:$A$79=$I$1,ROW($A$1:$A$79)),ROW(3:3)),8)),\"\",INDEX($A$1:$H$79,SMALL(IF($A$1:$A$79=$I$1,ROW($A$1:$A$79)),ROW(3:3)),8))","v":""},{"$f":"IF(ISERROR(INDEX($A$1:$G$79,SMALL(IF($B$1:$B$79=$N$1,ROW($B$1:$B$79)),ROW(3:3)),6)),\"\",INDEX($A$1:$G$79,SMALL(IF($B$1:$B$79=$N$1,ROW($B$1:$B$79)),ROW(3:3)),6))","v":""},{"$f":"IF(ISERROR(INDEX($A$1:$G$79,SMALL(IF($B$1:$B$79=$N$1,ROW($B$1:$B$79)),ROW(3:3)),4)),\"\",INDEX($A$1:$G$79,SMALL(IF($B$1:$B$79=$N$1,ROW($B$1:$B$79)),ROW(3:3)),4))","v":""},{"$f":"IF(ISERROR(INDEX($A$1:$G$79,SMALL(IF($B$1:$B$79=$N$1,ROW($B$1:$B$79)),ROW(3:3)),5)),\"\",INDEX($A$1:$G$79,SMALL(IF($B$1:$B$79=$N$1,ROW($B$1:$B$79)),ROW(3:3)),5))","v":""},{"$f":"IF(ISERROR(INDEX($A$1:$G$79,SMALL(IF($B$1:$B$79=$N$1,ROW($B$1:$B$79)),ROW(3:3)),7)),\"\",INDEX($A$1:$G$79,SMALL(IF($B$1:$B$79=$N$1,ROW($B$1:$B$79)),ROW(3:3)),7))","v":""},{"$f":"IF(ISERROR(INDEX($A$1:$H$79,SMALL(IF($B$1:$B$79=$N$1,ROW($B$1:$B$79)),ROW(3:3)),8)),\"\",INDEX($A$1:$H$79,SMALL(IF($B$1:$B$79=$N$1,ROW($B$1:$B$79)),ROW(3:3)),8))","v":""},{"$f":"IF(ISERROR(INDEX($A$1:$G$79,SMALL(IF($C$1:$C$79=$S$1,ROW($C$1:$C$79)),ROW(3:3)),6)),\"\",INDEX($A$1:$G$79,SMALL(IF($C$1:$C$79=$S$1,ROW($C$1:$C$79)),ROW(3:3)),6))","v":""},{"$f":"IF(ISERROR(INDEX($A$1:$G$79,SMALL(IF($C$1:$C$79=$S$1,ROW($C$1:$C$79)),ROW(3:3)),4)),\"\",INDEX($A$1:$G$79,SMALL(IF($C$1:$C$79=$S$1,ROW($C$1:$C$79)),ROW(3:3)),4))","v":""},{"$f":"IF(ISERROR(INDEX($A$1:$G$79,SMALL(IF($C$1:$C$79=$S$1,ROW($C$1:$C$79)),ROW(3:3)),5)),\"\",INDEX($A$1:$G$79,SMALL(IF($C$1:$C$79=$S$1,ROW($C$1:$C$79)),ROW(3:3)),5))","v":""},{"$f":"IF(ISERROR(INDEX($A$1:$G$79,SMALL(IF($C$1:$C$79=$S$1,ROW($C$1:$C$79)),ROW(3:3)),7)),\"\",INDEX($A$1:$G$79,SMALL(IF($C$1:$C$79=$S$1,ROW($C$1:$C$79)),ROW(3:3)),7))","v":""},{"$f":"IF(ISERROR(INDEX($A$1:$H$79,SMALL(IF($C$1:$C$79=$S$1,ROW($C$1:$C$79)),ROW(3:3)),8)),\"\",INDEX($A$1:$H$79,SMALL(IF($C$1:$C$79=$S$1,ROW($C$1:$C$79)),ROW(3:3)),8))","v":""}," ","Non-documented (J-L)"]
[{"$f":"'Access & Input'!F10","v":0},{"$f":"'Access & Input'!G10","v":0},{"$f":"'Access & Input'!H10","v":0},{"$f":"'Access & Input'!B10","v":0},{"$f":"'Access & Input'!C10","v":0},{"$f":"'Access & Input'!D10","v":"Optional notes here"},"Access",0,{"$f":"IF(ISERROR(INDEX($A$1:$G$79,SMALL(IF($A$1:$A$79=$I$1,ROW($A$1:$A$79)),ROW(4:4)),7)),\"\",INDEX($A$1:$G$79,SMALL(IF($A$1:$A$79=$I$1,ROW($A$1:$A$79)),ROW(4:4)),7))","v":""},{"$f":"IF(ISERROR(INDEX($A$1:$G$79,SMALL(IF($A$1:$A$79=$I$1,ROW($A$1:$A$79)),ROW(4:4)),4)),\"\",INDEX($A$1:$G$79,SMALL(IF($A$1:$A$79=$I$1,ROW($A$1:$A$79)),ROW(4:4)),4))","v":""},{"$f":"IF(ISERROR(INDEX($A$1:$G$79,SMALL(IF($A$1:$A$79=$I$1,ROW($A$1:$A$79)),ROW(4:4)),5)),\"\",INDEX($A$1:$G$79,SMALL(IF($A$1:$A$79=$I$1,ROW($A$1:$A$79)),ROW(4:4)),5))","v":""},{"$f":"IF(ISERROR(INDEX($A$1:$G$79,SMALL(IF($A$1:$A$79=$I$1,ROW($A$1:$A$79)),ROW(4:4)),6)),\"\",INDEX($A$1:$G$79,SMALL(IF($A$1:$A$79=$I$1,ROW($A$1:$A$79)),ROW(4:4)),6))","v":""},{"$f":"IF(ISERROR(INDEX($A$1:$H$79,SMALL(IF($A$1:$A$79=$I$1,ROW($A$1:$A$79)),ROW(4:4)),8)),\"\",INDEX($A$1:$H$79,SMALL(IF($A$1:$A$79=$I$1,ROW($A$1:$A$79)),ROW(4:4)),8))","v":""},{"$f":"IF(ISERROR(INDEX($A$1:$G$79,SMALL(IF($B$1:$B$79=$N$1,ROW($B$1:$B$79)),ROW(4:4)),6)),\"\",INDEX($A$1:$G$79,SMALL(IF($B$1:$B$79=$N$1,ROW($B$1:$B$79)),ROW(4:4)),6))","v":""},{"$f":"IF(ISERROR(INDEX($A$1:$G$79,SMALL(IF($B$1:$B$79=$N$1,ROW($B$1:$B$79)),ROW(4:4)),4)),\"\",INDEX($A$1:$G$79,SMALL(IF($B$1:$B$79=$N$1,ROW($B$1:$B$79)),ROW(4:4)),4))","v":""},{"$f":"IF(ISERROR(INDEX($A$1:$G$79,SMALL(IF($B$1:$B$79=$N$1,ROW($B$1:$B$79)),ROW(4:4)),5)),\"\",INDEX($A$1:$G$79,SMALL(IF($B$1:$B$79=$N$1,ROW($B$1:$B$79)),ROW(4:4)),5))","v":""},{"$f":"IF(ISERROR(INDEX($A$1:$G$79,SMALL(IF($B$1:$B$79=$N$1,ROW($B$1:$B$79)),ROW(4:4)),7)),\"\",INDEX($A$1:$G$79,SMALL(IF($B$1:$B$79=$N$1,ROW($B$1:$B$79)),ROW(4:4)),7))","v":""},{"$f":"IF(ISERROR(INDEX($A$1:$H$79,SMALL(IF($B$1:$B$79=$N$1,ROW($B$1:$B$79)),ROW(4:4)),8)),\"\",INDEX($A$1:$H$79,SMALL(IF($B$1:$B$79=$N$1,ROW($B$1:$B$79)),ROW(4:4)),8))","v":""},{"$f":"IF(ISERROR(INDEX($A$1:$G$79,SMALL(IF($C$1:$C$79=$S$1,ROW($C$1:$C$79)),ROW(4:4)),6)),\"\",INDEX($A$1:$G$79,SMALL(IF($C$1:$C$79=$S$1,ROW($C$1:$C$79)),ROW(4:4)),6))","v":""},{"$f":"IF(ISERROR(INDEX($A$1:$G$79,SMALL(IF($C$1:$C$79=$S$1,ROW($C$1:$C$79)),ROW(4:4)),4)),\"\",INDEX($A$1:$G$79,SMALL(IF($C$1:$C$79=$S$1,ROW($C$1:$C$79)),ROW(4:4)),4))","v":""},{"$f":"IF(ISERROR(INDEX($A$1:$G$79,SMALL(IF($C$1:$C$79=$S$1,ROW($C$1:$C$79)),ROW(4:4)),5)),\"\",INDEX($A$1:$G$79,SMALL(IF($C$1:$C$79=$S$1,ROW($C$1:$C$79)),ROW(4:4)),5))","v":""},{"$f":"IF(ISERROR(INDEX($A$1:$G$79,SMALL(IF($C$1:$C$79=$S$1,ROW($C$1:$C$79)),ROW(4:4)),7)),\"\",INDEX($A$1:$G$79,SMALL(IF($C$1:$C$79=$S$1,ROW($C$1:$C$79)),ROW(4:4)),7))","v":""},{"$f":"IF(ISERROR(INDEX($A$1:$H$79,SMALL(IF($C$1:$C$79=$S$1,ROW($C$1:$C$79)),ROW(4:4)),8)),\"\",INDEX($A$1:$H$79,SMALL(IF($C$1:$C$79=$S$1,ROW($C$1:$C$79)),ROW(4:4)),8))","v":""}," ","Non-evidenced (M-O)"]
[{"$f":"'Access & Input'!F11","v":"Please select answer"},{"$f":"'Access & Input'!G11","v":"Please select answer"},{"$f":"'Access & Input'!H11","v":"Please select answer"},{"$f":"'Access & Input'!B11","v":3},{"$f":"'Access & Input'!C11","v":"Access regardless of sexual orientation, gender identity, or marital status"},{"$f":"'Access & Input'!D11","v":"Equal access is provided in accordance with the 2012 and 2016 Equal Access Rules, meaning that any project funded by HUD must ensure equal access for persons regardless of one’s sexual orientation or marital status, and in accordance with one’s gender identity. Adult only households, regardless of marital status, should have equal access to projects (if these project types are not available within a CoC, the CoC should conduct an assessment to determine if these project types are needed and work with providers to accommodate the need). Please see Equal Access Rules here: https://www.hudexchange.info/resource/1991/equal-access-to-housing-final-rule/ "},"Access",{"$f":"F7","v":"Optional notes here"},{"$f":"IF(ISERROR(INDEX($A$1:$G$79,SMALL(IF($A$1:$A$79=$I$1,ROW($A$1:$A$79)),ROW(5:5)),7)),\"\",INDEX($A$1:$G$79,SMALL(IF($A$1:$A$79=$I$1,ROW($A$1:$A$79)),ROW(5:5)),7))","v":""},{"$f":"IF(ISERROR(INDEX($A$1:$G$79,SMALL(IF($A$1:$A$79=$I$1,ROW($A$1:$A$79)),ROW(5:5)),4)),\"\",INDEX($A$1:$G$79,SMALL(IF($A$1:$A$79=$I$1,ROW($A$1:$A$79)),ROW(5:5)),4))","v":""},{"$f":"IF(ISERROR(INDEX($A$1:$G$79,SMALL(IF($A$1:$A$79=$I$1,ROW($A$1:$A$79)),ROW(5:5)),5)),\"\",INDEX($A$1:$G$79,SMALL(IF($A$1:$A$79=$I$1,ROW($A$1:$A$79)),ROW(5:5)),5))","v":""},{"$f":"IF(ISERROR(INDEX($A$1:$G$79,SMALL(IF($A$1:$A$79=$I$1,ROW($A$1:$A$79)),ROW(5:5)),6)),\"\",INDEX($A$1:$G$79,SMALL(IF($A$1:$A$79=$I$1,ROW($A$1:$A$79)),ROW(5:5)),6))","v":""},{"$f":"IF(ISERROR(INDEX($A$1:$H$79,SMALL(IF($A$1:$A$79=$I$1,ROW($A$1:$A$79)),ROW(5:5)),8)),\"\",INDEX($A$1:$H$79,SMALL(IF($A$1:$A$79=$I$1,ROW($A$1:$A$79)),ROW(5:5)),8))","v":""},{"$f":"IF(ISERROR(INDEX($A$1:$G$79,SMALL(IF($B$1:$B$79=$N$1,ROW($B$1:$B$79)),ROW(5:5)),6)),\"\",INDEX($A$1:$G$79,SMALL(IF($B$1:$B$79=$N$1,ROW($B$1:$B$79)),ROW(5:5)),6))","v":""},{"$f":"IF(ISERROR(INDEX($A$1:$G$79,SMALL(IF($B$1:$B$79=$N$1,ROW($B$1:$B$79)),ROW(5:5)),4)),\"\",INDEX($A$1:$G$79,SMALL(IF($B$1:$B$79=$N$1,ROW($B$1:$B$79)),ROW(5:5)),4))","v":""},{"$f":"IF(ISERROR(INDEX($A$1:$G$79,SMALL(IF($B$1:$B$79=$N$1,ROW($B$1:$B$79)),ROW(5:5)),5)),\"\",INDEX($A$1:$G$79,SMALL(IF($B$1:$B$79=$N$1,ROW($B$1:$B$79)),ROW(5:5)),5))","v":""},{"$f":"IF(ISERROR(INDEX($A$1:$G$79,SMALL(IF($B$1:$B$79=$N$1,ROW($B$1:$B$79)),ROW(5:5)),7)),\"\",INDEX($A$1:$G$79,SMALL(IF($B$1:$B$79=$N$1,ROW($B$1:$B$79)),ROW(5:5)),7))","v":""},{"$f":"IF(ISERROR(INDEX($A$1:$H$79,SMALL(IF($B$1:$B$79=$N$1,ROW($B$1:$B$79)),ROW(5:5)),8)),\"\",INDEX($A$1:$H$79,SMALL(IF($B$1:$B$79=$N$1,ROW($B$1:$B$79)),ROW(5:5)),8))","v":""},{"$f":"IF(ISERROR(INDEX($A$1:$G$79,SMALL(IF($C$1:$C$79=$S$1,ROW($C$1:$C$79)),ROW(5:5)),6)),\"\",INDEX($A$1:$G$79,SMALL(IF($C$1:$C$79=$S$1,ROW($C$1:$C$79)),ROW(5:5)),6))","v":""},{"$f":"IF(ISERROR(INDEX($A$1:$G$79,SMALL(IF($C$1:$C$79=$S$1,ROW($C$1:$C$79)),ROW(5:5)),4)),\"\",INDEX($A$1:$G$79,SMALL(IF($C$1:$C$79=$S$1,ROW($C$1:$C$79)),ROW(5:5)),4))","v":""},{"$f":"IF(ISERROR(INDEX($A$1:$G$79,SMALL(IF($C$1:$C$79=$S$1,ROW($C$1:$C$79)),ROW(5:5)),5)),\"\",INDEX($A$1:$G$79,SMALL(IF($C$1:$C$79=$S$1,ROW($C$1:$C$79)),ROW(5:5)),5))","v":""},{"$f":"IF(ISERROR(INDEX($A$1:$G$79,SMALL(IF($C$1:$C$79=$S$1,ROW($C$1:$C$79)),ROW(5:5)),7)),\"\",INDEX($A$1:$G$79,SMALL(IF($C$1:$C$79=$S$1,ROW($C$1:$C$79)),ROW(5:5)),7))","v":""},{"$f":"IF(ISERROR(INDEX($A$1:$H$79,SMALL(IF($C$1:$C$79=$S$1,ROW($C$1:$C$79)),ROW(5:5)),8)),\"\",INDEX($A$1:$H$79,SMALL(IF($C$1:$C$79=$S$1,ROW($C$1:$C$79)),ROW(5:5)),8))","v":""}," "]
{"$rows_left_out":93}
{"sheet":"Scratch - Report","index":8,"n_rows":75,"n_cols":23,"rows_kept":75,"cut":false,"hidden":true,"merged":[]}
[]
[]
[null,"This page does not comprise part of the assessment. It is for information only."]
[]
[null,"Numbers","Access",null,null,"Participant Input",null,null,"Services",null,null,"Housing",null,null,"Leases",null,null,"Project-specific",null,null,"Population"]
[null,null,"Not at all","Somewhat","Always","Not at all","Somewhat","Always","Not at all","Somewhat","Always","Not at all","Somewhat","Always","Not at all","Somewhat","Always","Not at all","Somewhat","Always","Not at all","Somewhat","Always"]
{"$rows_left_out":70}
{"sheet":"Assumptions","index":9,"n_rows":30,"n_cols":15,"rows_kept":30,"cut":false,"hidden":true,"merged":[]}
["Assumptions for the standards"]
[]
[null,"This page does not comprise part of the assessment. It is for information only."]
[]
[null,"Project standards",null,null,null,null,null,null,null,null,"Project standards"]
[null,"Standards","Coordinated Entry","Street Outreach","Emergency Shelter","Transitional Housing","Rapid Rehousing","Permanent Supportive Housing","Joint Transitional Housing & Rapid Rehousing",null,null,"Youth and Young Adults","People in Recovery","Domestic Violence Survivors","None of the above"]
{"$rows_left_out":24}